program: Orca
programVersion: 5.0.3
elementType: Cl Cl O O O C C C C C C C C C C C C C C C C C C C C C H H H H H H H H H H H H H H H H H H H H
charge: 0
multiplicity: 1
keywords: wb97x-d3
keywords: def2-TZVPP
keywords: def2/J RIJCOSX
keywords: DEFGRID2
keywords: scfconv7
keywords: smallprint printgap noloewdin
keywords: NOSOSCF
formula: C21H20Cl2O3
InChI: InChI=1/C21H20Cl2O3/c1-21(2)17(12-18(22)23)19(21)20(24)25-13-14-7-6-10-16(11-14)26-15-8-4-3-5-9-15/h3-12,17,19H,13H2,1-2H3
46 atoms
Cl 4.71477 -2.265209 -1.832392
Cl 5.596492 -1.920452 0.892802
O  -1.310133 -1.154131 -0.297537
O  -0.404196 -1.970277 -2.171469
O  -2.975122 3.546885 1.710279
C  0.944224 -3.989418 -0.190204
C  1.911054 -2.898013 -0.546563
C  0.526343 -2.542308 -0.041183
C  1.127122 -4.760751 1.095832
C  0.404606 -4.842822 -1.312631
C  3.078076 -2.577143 0.283679
C  -0.420117 -1.883098 -0.971894
C  4.293751 -2.292346 -0.167252
C  -2.278146 -0.44097 -1.073084
C  -3.107399 0.373013 -0.126784
C  -2.636072 1.601315 0.322837
C  -4.334964 -0.097958 0.320406
C  -3.398355 2.356284 1.203897
C  -5.086183 0.657191 1.208138
C  -4.626881 1.88604 1.649409
C  -2.245058 4.406309 0.940528
C  -2.593221 4.699063 -0.372527
C  -1.164799 5.03666 1.539916
C  -1.845188 5.625132 -1.082479
C  -0.431466 5.968063 0.820998
C  -0.763979 6.263578 -0.492272
H  2.043609 -2.749489 -1.612095
H  0.461046 -2.188248 0.981697
H  1.441663 -4.137094 1.931939
H  0.188791 -5.236564 1.384973
H  1.873505 -5.546634 0.969347
H  1.053624 -5.708846 -1.454173
H  -0.592991 -5.214934 -1.070594
H  0.343841 -4.312578 -2.259236
H  2.950273 -2.558875 1.358997
H  -1.77351 0.196622 -1.802554
H  -2.900144 -1.144866 -1.631253
H  -1.674351 1.966752 -0.017585
H  -4.70534 -1.054698 -0.025574
H  -6.043659 0.291079 1.553916
H  -5.210108 2.486131 2.335305
H  -3.442974 4.214434 -0.836108
H  -0.910035 4.798802 2.564313
H  -2.117805 5.853925 -2.10431
H  0.409036 6.460438 1.291853
H  -0.18751 6.987656 -1.051599
totalener: -1958.42691614 hartree
nucrepener: 2397.04640587 hartree
electener: -4355.47332202 hartree
oneelecener: -7447.08783710 hartree
twoeener: 3091.61451508 hartree
kineticenergy: 1952.61268395 hartree
xcener: -143.510038038384 hartree
chargesum: 0.0000000
charge: -0.041272 -0.048951 -0.253586 -0.384754 -0.298506 0.069733 0.043534 -0.084018 -0.242399 -0.249262 -0.201105 0.335315 0.049826 0.046052 0.011926 -0.154582 -0.156189 0.216225 -0.097663 -0.198580 0.240894 -0.164866 -0.207400 -0.113131 -0.089835 -0.143987 0.085698 0.078166 0.071777 0.093048 0.097626 0.087602 0.084635 0.104028 0.095963 0.104168 0.098449 0.119407 0.108669 0.124806 0.126378 0.132544 0.125052 0.127182 0.125449 0.125934
qa: -0.0413 -0.0490 -0.2536 -0.3848 -0.2985 0.0697 0.0435 -0.0840 -0.2424 -0.2493 -0.2011 0.3353 0.0498 0.0461 0.0119 -0.1546 -0.1562 0.2162 -0.0977 -0.1986 0.2409 -0.1649 -0.2074 -0.1131 -0.0898 -0.1440 0.0857 0.0782 0.0718 0.0930 0.0976 0.0876 0.0846 0.1040 0.0960 0.1042 0.0984 0.1194 0.1087 0.1248 0.1264 0.1325 0.1251 0.1272 0.1254 0.1259
va: 1.2860 1.2561 2.1371 2.1164 2.1075 3.7558 3.8189 3.8842 3.9106 3.9137 3.9229 4.2399 4.2458 3.8442 3.7653 3.9109 3.9823 3.8501 3.9569 4.0314 3.8102 3.9471 4.0387 3.9455 3.9329 3.9622 1.0507 1.0351 1.0102 1.0041 1.0031 1.0013 1.0020 1.0226 1.0308 1.0001 1.0034 1.0152 1.0114 0.9998 1.0126 1.0037 1.0138 0.9998 0.9989 1.0004
dispcorr: -0.020475184 hartree
energy: -1958.447391327463
dipole: -31.52334 30.71999 -0.80336 -0.66487 0.55105 -0.11382 2.08843 -1.60819 0.48024
magnitude: 0.94285 au
magnitude: 2.39654 debye
