program: Orca
programVersion: 5.0.3
elementType: Cl Cl O O O C C C C C C C C C C C C C C C C C C C C C H H H H H H H H H H H H H H H H H H H H
charge: 0
multiplicity: 1
keywords: wb97x-d3
keywords: def2-TZVPP
keywords: def2/J RIJCOSX
keywords: DEFGRID2
keywords: scfconv7
keywords: smallprint printgap noloewdin
keywords: NOSOSCF
formula: C21H20Cl2O3
InChI: InChI=1/C21H20Cl2O3/c1-21(2)17(12-18(22)23)19(21)20(24)25-13-14-7-6-10-16(11-14)26-15-8-4-3-5-9-15/h3-12,17,19H,13H2,1-2H3
46 atoms
Cl 3.03443 -4.755751 -0.702973
Cl 5.168438 -3.409421 -2.099456
O  -1.093385 -0.09127 -1.884085
O  -1.197789 -1.860684 -0.516415
O  -3.064236 3.569322 1.139411
C  1.537887 -0.703824 0.481945
C  1.783434 -1.878373 -0.421306
C  0.88863 -0.74774 -0.8849
C  2.608608 0.344507 0.672443
C  0.720167 -0.937999 1.728832
C  3.065775 -2.092895 -1.103026
C  -0.561951 -0.992251 -1.048626
C  3.667091 -3.264241 -1.272097
C  -2.507603 -0.115691 -2.042788
C  -3.217514 0.522836 -0.881064
C  -2.770267 1.739041 -0.379119
C  -4.34949 -0.068521 -0.335611
C  -3.457581 2.352448 0.658005
C  -5.039698 0.56138 0.688398
C  -4.595743 1.771949 1.196063
C  -1.787944 3.725027 1.591209
C  -1.211962 4.979184 1.436764
C  -1.090247 2.704947 2.227505
C  0.064388 5.211635 1.923306
C  0.187617 2.952539 2.706515
C  0.773156 4.200754 2.556478
H  1.250514 -2.779264 -0.139787
H  1.310293 -0.062251 -1.611679
H  3.158011 0.568966 -0.24106
H  2.160527 1.278722 1.015557
H  3.332401 0.022317 1.422973
H  1.385858 -1.167763 2.562391
H  0.157289 -0.040145 1.990197
H  0.013104 -1.757025 1.630096
H  3.573835 -1.230996 -1.51785
H  -2.692239 0.451418 -2.956237
H  -2.866747 -1.134511 -2.200814
H  -1.889072 2.214336 -0.794006
H  -4.689608 -1.026216 -0.708329
H  -5.921429 0.097021 1.109457
H  -5.121761 2.267372 2.001355
H  -1.769683 5.76355 0.942264
H  -1.540781 1.72938 2.359435
H  0.50787 6.19103 1.801494
H  0.724645 2.159852 3.211722
H  1.768949 4.386138 2.935424
totalener: -1958.42636590 hartree
nucrepener: 2523.22492269 hartree
electener: -4481.65128859 hartree
oneelecener: -7699.33196878 hartree
twoeener: 3217.68068019 hartree
kineticenergy: 1952.62036849 hartree
xcener: -143.514615100628 hartree
chargesum: -0.0000000
charge: -0.040894 -0.048844 -0.273693 -0.372689 -0.301443 0.093719 0.036017 -0.069128 -0.252699 -0.244841 -0.202751 0.330117 0.048907 0.067706 0.037136 -0.192265 -0.150135 0.199685 -0.093097 -0.193199 0.219115 -0.199766 -0.115374 -0.093639 -0.182050 -0.137704 0.085380 0.076333 0.072438 0.093500 0.097100 0.093035 0.054022 0.108574 0.094970 0.109232 0.103892 0.125091 0.108412 0.125715 0.127467 0.125660 0.138944 0.125050 0.140296 0.126701
qa: -0.0409 -0.0488 -0.2737 -0.3727 -0.3014 0.0937 0.0360 -0.0691 -0.2527 -0.2448 -0.2028 0.3301 0.0489 0.0677 0.0371 -0.1923 -0.1501 0.1997 -0.0931 -0.1932 0.2191 -0.1998 -0.1154 -0.0936 -0.1820 -0.1377 0.0854 0.0763 0.0724 0.0935 0.0971 0.0930 0.0540 0.1086 0.0950 0.1092 0.1039 0.1251 0.1084 0.1257 0.1275 0.1257 0.1389 0.1250 0.1403 0.1267
va: 1.2867 1.2561 2.1217 2.1303 2.0996 3.7135 3.8520 3.8437 3.9131 3.9092 3.9249 4.2669 4.2471 3.8602 3.6848 3.9557 4.0069 3.8456 3.9376 4.0405 3.8507 4.0227 3.8602 3.9539 3.9386 3.9551 1.0511 1.0363 1.0126 1.0084 1.0020 1.0014 1.0189 1.0275 1.0317 0.9886 1.0129 1.0226 1.0126 0.9998 1.0109 1.0136 1.0003 0.9983 0.9912 1.0004
dispcorr: -0.024449867 hartree
energy: -1958.450815768735
dipole: -18.38214 18.27917 -0.10297 27.89430 -27.00947 0.88483 15.45522 -15.42769 0.02754
magnitude: 0.89123 au
magnitude: 2.26532 debye
