program: Orca
programVersion: 5.0.3
elementType: Cl Cl O O O C C C C C C C C C C C C C C C C C C C C C H H H H H H H H H H H H H H H H H H H H
charge: 0
multiplicity: 1
keywords: wb97x-d3
keywords: def2-TZVPP
keywords: def2/J RIJCOSX
keywords: DEFGRID2
keywords: scfconv7
keywords: smallprint printgap noloewdin
keywords: NOSOSCF
formula: C21H20Cl2O3
InChI: InChI=1/C21H20Cl2O3/c1-21(2)17(12-18(22)23)19(21)20(24)25-13-14-7-6-10-16(11-14)26-15-8-4-3-5-9-15/h3-12,17,19H,13H2,1-2H3
46 atoms
Cl 4.878966 -1.404391 -0.060635
Cl 5.212087 -4.267696 -0.203079
O  -1.533407 -1.955818 0.908703
O  -0.097328 -0.245779 0.760582
O  -3.439642 3.435382 0.057958
C  0.855777 -1.922507 -1.728917
C  1.843493 -2.009371 -0.599735
C  0.385549 -2.311314 -0.342084
C  0.819289 -3.013128 -2.77245
C  0.55054 -0.557088 -2.295513
C  2.831718 -3.092186 -0.514229
C  -0.405292 -1.376372 0.492017
C  4.130489 -2.933216 -0.291212
C  -2.460999 -1.129486 1.616639
C  -3.149166 -0.166125 0.691482
C  -2.95421 1.199363 0.837613
C  -3.962769 -0.645901 -0.329548
C  -3.559577 2.084806 -0.04581
C  -4.570722 0.244137 -1.19946
C  -4.368186 1.608474 -1.068323
C  -2.298646 4.018453 0.528405
C  -2.45811 5.172574 1.282811
C  -1.027587 3.540614 0.232366
C  -1.341005 5.853384 1.739641
C  0.080222 4.226557 0.706503
C  -0.067127 5.382765 1.458144
H  2.172243 -1.049621 -0.217567
H  0.110206 -3.354364 -0.229685
H  1.597924 -2.854846 -3.520436
H  0.960154 -4.010134 -2.356588
H  -0.142651 -3.009808 -3.287077
H  1.243696 -0.337156 -3.109031
H  -0.46158 -0.523951 -2.703205
H  0.641187 0.237249 -1.559069
H  2.488425 -4.111438 -0.642652
H  -3.17361 -1.831181 2.050029
H  -1.96366 -0.602658 2.433311
H  -2.311924 1.564311 1.628701
H  -4.118271 -1.711099 -0.446353
H  -5.205331 -0.124436 -1.994449
H  -4.834346 2.308397 -1.749131
H  -3.455319 5.531576 1.500906
H  -0.894323 2.638718 -0.350742
H  -1.470497 6.753835 2.325508
H  1.068357 3.848368 0.480774
H  0.803357 5.911961 1.821178
totalener: -1958.42642688 hartree
nucrepener: 2493.79566143 hartree
electener: -4452.22208831 hartree
oneelecener: -7640.80882757 hartree
twoeener: 3188.58673926 hartree
kineticenergy: 1952.62242368 hartree
xcener: -143.514641643180 hartree
chargesum: -0.0000000
charge: -0.041631 -0.048101 -0.264386 -0.388267 -0.297785 0.073432 0.042183 -0.088332 -0.242328 -0.241968 -0.202872 0.352090 0.049307 0.052034 0.004040 -0.159955 -0.221392 0.265448 -0.071534 -0.225815 0.278463 -0.225047 -0.180641 -0.085738 -0.111240 -0.148429 0.086542 0.076921 0.098416 0.070754 0.093231 0.091192 0.090097 0.086920 0.097055 0.115661 0.103560 0.124875 0.112820 0.125249 0.125218 0.122682 0.132786 0.124199 0.126269 0.124016
qa: -0.0416 -0.0481 -0.2644 -0.3883 -0.2978 0.0734 0.0422 -0.0883 -0.2423 -0.2420 -0.2029 0.3521 0.0493 0.0520 0.0040 -0.1600 -0.2214 0.2654 -0.0715 -0.2258 0.2785 -0.2250 -0.1806 -0.0857 -0.1112 -0.1484 0.0865 0.0769 0.0984 0.0708 0.0932 0.0912 0.0901 0.0869 0.0971 0.1157 0.1036 0.1249 0.1128 0.1252 0.1252 0.1227 0.1328 0.1242 0.1263 0.1240
va: 1.2855 1.2574 2.1331 2.1138 2.1199 3.7619 3.8233 3.8558 3.9068 3.9165 3.9144 4.2561 4.2425 3.8631 3.6699 3.9106 4.0171 3.8326 3.9144 4.0495 3.7855 4.0411 3.9498 3.9280 3.9510 3.9638 1.0498 1.0362 1.0034 1.0098 1.0044 1.0028 1.0022 1.0228 1.0289 0.9905 1.0105 1.0171 1.0157 0.9985 1.0137 1.0155 0.9992 0.9988 0.9998 1.0006
dispcorr: -0.023029038 hartree
energy: -1958.449455921500
dipole: -29.75687 29.03296 -0.72392 12.81755 -13.39529 -0.57774 -8.48092 8.13257 -0.34835
magnitude: 0.98954 au
magnitude: 2.51521 debye
