program: Orca
programVersion: 5.0.3
elementType: Cl Cl O O O C C C C C C C C C C C C C C C C C C C C C H H H H H H H H H H H H H H H H H H H H
charge: 0
multiplicity: 1
keywords: wb97x-d3
keywords: def2-TZVPP
keywords: def2/J RIJCOSX
keywords: DEFGRID2
keywords: scfconv7
keywords: smallprint printgap noloewdin
keywords: NOSOSCF
formula: C21H20Cl2O3
InChI: InChI=1/C21H20Cl2O3/c1-21(2)17(12-18(22)23)19(21)20(24)25-13-14-7-6-10-16(11-14)26-15-8-4-3-5-9-15/h3-12,17,19H,13H2,1-2H3
46 atoms
Cl 3.336959 -4.121991 1.440042
Cl 4.610093 -4.914211 -1.0265
O  -1.630569 -1.325647 -1.727635
O  -1.106378 -1.742188 0.40779
O  -2.350147 3.565112 -0.599436
C  1.67384 -0.650325 -0.689188
C  1.721329 -2.117344 -0.360838
C  0.619636 -1.585813 -1.244736
C  2.649574 -0.076511 -1.688781
C  1.334886 0.31068 0.424014
C  2.732005 -3.014332 -0.936797
C  -0.770358 -1.573045 -0.731845
C  3.457703 -3.894147 -0.258003
C  -3.00198 -1.200156 -1.371483
C  -3.293509 0.055335 -0.596864
C  -2.665262 1.251486 -0.926879
C  -4.21581 0.033064 0.438876
C  -2.961026 2.403981 -0.21924
C  -4.516919 1.196357 1.132108
C  -3.890838 2.388371 0.812839
C  -1.644603 4.280427 0.32173
C  -0.98604 3.686628 1.392494
C  -1.567224 5.652726 0.122688
C  -0.250139 4.480574 2.259968
C  -0.824317 6.430613 0.995323
C  -0.165153 5.851225 2.070347
H  1.404401 -2.3617 0.646636
H  0.700641 -1.783099 -2.308418
H  3.606869 0.137114 -1.210817
H  2.842382 -0.74154 -2.529752
H  2.26522 0.859371 -2.096934
H  2.249022 0.619493 0.933422
H  0.8594 1.210507 0.027722
H  0.669939 -0.120739 1.168698
H  2.906514 -2.971535 -2.00492
H  -3.530912 -1.189556 -2.325741
H  -3.337941 -2.076524 -0.812185
H  -1.939035 1.298535 -1.729125
H  -4.692978 -0.898365 0.716129
H  -5.239296 1.171927 1.937031
H  -4.118329 3.296085 1.356751
H  -1.040588 2.617203 1.551658
H  -2.085888 6.098642 -0.715911
H  0.263277 4.015878 3.091569
H  -0.768025 7.499436 0.836275
H  0.410018 6.46223 2.752515
totalener: -1958.42590986 hartree
nucrepener: 2486.94415424 hartree
electener: -4445.37006409 hartree
oneelecener: -7626.94924517 hartree
twoeener: 3181.57918107 hartree
kineticenergy: 1952.61976317 hartree
xcener: -143.513670834301 hartree
chargesum: 0.0000000
charge: -0.041035 -0.048601 -0.272720 -0.362132 -0.300790 0.075978 0.044220 -0.079055 -0.240421 -0.257963 -0.203723 0.317922 0.047791 0.063438 0.072707 -0.272676 -0.151435 0.218276 -0.106064 -0.145684 0.249586 -0.170019 -0.203396 -0.136514 -0.094545 -0.142227 0.086173 0.077652 0.098399 0.071143 0.094985 0.094248 0.083783 0.102287 0.097242 0.108571 0.104113 0.121171 0.105659 0.127025 0.133773 0.134654 0.124142 0.125785 0.124311 0.123969
qa: -0.0410 -0.0486 -0.2727 -0.3621 -0.3008 0.0760 0.0442 -0.0791 -0.2404 -0.2580 -0.2037 0.3179 0.0478 0.0634 0.0727 -0.2727 -0.1514 0.2183 -0.1061 -0.1457 0.2496 -0.1700 -0.2034 -0.1365 -0.0945 -0.1422 0.0862 0.0777 0.0984 0.0711 0.0950 0.0942 0.0838 0.1023 0.0972 0.1086 0.1041 0.1212 0.1057 0.1270 0.1338 0.1347 0.1241 0.1258 0.1243 0.1240
va: 1.2863 1.2567 2.1197 2.1411 2.0943 3.7697 3.8339 3.8444 3.9030 3.9106 3.9153 4.2821 4.2436 3.8581 3.6427 4.0370 4.0228 3.8499 3.9544 3.9805 3.7900 3.8956 4.0230 3.9810 3.9448 3.9578 1.0512 1.0359 1.0037 1.0092 1.0046 1.0045 1.0017 1.0187 1.0287 0.9880 1.0089 1.0298 1.0126 1.0004 1.0024 1.0034 1.0145 1.0009 0.9987 1.0004
dispcorr: -0.023400784 hartree
energy: -1958.449310642582
dipole: -18.48873 18.11150 -0.37722 33.92647 -33.25668 0.66979 -1.03181 0.61283 -0.41897
magnitude: 0.87548 au
magnitude: 2.22528 debye
