program: Orca
programVersion: 5.0.3
elementType: Cl Cl O O O C C C C C C C C C C C C C C C C C C C C C H H H H H H H H H H H H H H H H H H H H
charge: 0
multiplicity: 1
keywords: wb97x-d3
keywords: def2-TZVPP
keywords: def2/J RIJCOSX
keywords: DEFGRID2
keywords: scfconv7
keywords: smallprint printgap noloewdin
keywords: NOSOSCF
formula: C21H20Cl2O3
InChI: InChI=1/C21H20Cl2O3/c1-21(2)17(12-18(22)23)19(21)20(24)25-13-14-7-6-10-16(11-14)26-15-8-4-3-5-9-15/h3-12,17,19H,13H2,1-2H3
46 atoms
Cl 3.485695 -4.036538 1.352398
Cl 4.769098 -4.709552 -1.143328
O  -1.681643 -1.442335 -1.665115
O  -1.084291 -1.862003 0.450964
O  -2.219993 3.443367 -0.578747
C  1.600381 -0.624936 -0.71023
C  1.740417 -2.08806 -0.389586
C  0.588813 -1.619106 -1.243931
C  2.516051 0.008042 -1.730432
C  1.231905 0.312969 0.413791
C  2.788869 -2.919655 -0.994929
C  -0.786119 -1.670657 -0.695515
C  3.570241 -3.771143 -0.342295
C  -3.037772 -1.303155 -1.26043
C  -3.285765 -0.026111 -0.504912
C  -2.62421 1.144151 -0.860196
C  -4.196326 -0.003492 0.541367
C  -2.872247 2.316995 -0.166801
C  -4.45202 1.179994 1.217927
C  -3.79274 2.347342 0.87371
C  -1.597423 4.235477 0.34025
C  -1.562114 5.597775 0.075379
C  -0.974989 3.722268 1.472191
C  -0.900711 6.448051 0.946751
C  -0.323033 4.587302 2.338227
C  -0.282363 5.949922 2.084106
H  1.463789 -2.354821 0.624024
H  0.652911 -1.807747 -2.310313
H  3.472871 0.270379 -1.276437
H  2.722105 -0.638621 -2.58252
H  2.070301 0.924497 -2.119946
H  0.690939 1.181379 0.031195
H  0.615243 -0.158385 1.175365
H  2.138509 0.678573 0.898584
H  2.946511 -2.847229 -2.064031
H  -3.603913 -1.310353 -2.193107
H  -3.357584 -2.163183 -0.667502
H  -1.906173 1.156463 -1.670815
H  -4.698611 -0.914817 0.840225
H  -5.165379 1.191899 2.031175
H  -3.987657 3.268462 1.407543
H  -2.049093 5.979955 -0.81205
H  -0.995198 2.659929 1.679821
H  -0.876232 7.509097 0.736246
H  0.160946 4.186091 3.218887
H  0.2279 6.617148 2.765149
totalener: -1958.42577803 hartree
nucrepener: 2490.91581440 hartree
electener: -4449.34159242 hartree
oneelecener: -7634.88333160 hartree
twoeener: 3185.54173918 hartree
kineticenergy: 1952.62095079 hartree
xcener: -143.514440809007 hartree
chargesum: 0.0000000
charge: -0.041096 -0.048845 -0.272499 -0.360597 -0.301551 0.075324 0.046329 -0.071979 -0.242263 -0.254322 -0.205146 0.307812 0.048304 0.064168 0.083566 -0.286825 -0.161443 0.233363 -0.102126 -0.157135 0.256640 -0.209984 -0.167840 -0.093087 -0.136545 -0.142494 0.085466 0.077480 0.098851 0.071497 0.094944 0.078972 0.104320 0.095267 0.096815 0.108241 0.104752 0.122394 0.105672 0.126903 0.133809 0.124498 0.134135 0.124849 0.126404 0.125000
qa: -0.0411 -0.0488 -0.2725 -0.3606 -0.3016 0.0753 0.0463 -0.0720 -0.2423 -0.2543 -0.2051 0.3078 0.0483 0.0642 0.0836 -0.2868 -0.1614 0.2334 -0.1021 -0.1571 0.2566 -0.2100 -0.1678 -0.0931 -0.1365 -0.1425 0.0855 0.0775 0.0989 0.0715 0.0949 0.0790 0.1043 0.0953 0.0968 0.1082 0.1048 0.1224 0.1057 0.1269 0.1338 0.1245 0.1341 0.1248 0.1264 0.1250
va: 1.2863 1.2564 2.1181 2.1413 2.0929 3.7710 3.8379 3.8365 3.9033 3.9079 3.9178 4.2946 4.2440 3.8573 3.6408 4.0336 4.0316 3.8357 3.9531 3.9708 3.7810 4.0339 3.9055 3.9412 3.9825 3.9592 1.0514 1.0356 1.0035 1.0093 1.0046 1.0033 1.0184 1.0045 1.0291 0.9880 1.0094 1.0300 1.0125 1.0004 1.0025 1.0145 1.0029 0.9987 1.0007 1.0003
dispcorr: -0.023630140 hartree
energy: -1958.449408166563
dipole: -20.18273 19.73286 -0.44988 33.64248 -32.87265 0.76983 -0.38436 0.00372 -0.38064
magnitude: 0.96949 au
magnitude: 2.46426 debye
