program: Orca
programVersion: 5.0.3
elementType: Cl Cl O O O C C C C C C C C C C C C C C C C C C C C C H H H H H H H H H H H H H H H H H H H H
charge: 0
multiplicity: 1
keywords: wb97x-d3
keywords: def2-TZVPP
keywords: def2/J RIJCOSX
keywords: DEFGRID2
keywords: scfconv7
keywords: smallprint printgap noloewdin
keywords: NOSOSCF
formula: C21H20Cl2O3
InChI: InChI=1/C21H20Cl2O3/c1-21(2)17(12-18(22)23)19(21)20(24)25-13-14-7-6-10-16(11-14)26-15-8-4-3-5-9-15/h3-12,17,19H,13H2,1-2H3
46 atoms
Cl 3.183162 0.115277 -1.381522
Cl 4.395779 0.660113 1.179001
O  -1.449319 -1.982943 -0.576022
O  -2.113177 -2.518428 1.490427
O  -2.378588 3.061398 -0.096652
C  1.204479 -3.318802 0.321425
C  1.310126 -1.821438 0.216978
C  0.206432 -2.441872 1.044179
C  2.18277 -4.069163 1.194022
C  0.818873 -4.091111 -0.91696
C  2.373498 -1.066384 0.894293
C  -1.232744 -2.325584 0.698875
C  3.205292 -0.220615 0.299607
C  -2.804257 -1.757729 -0.958348
C  -3.339953 -0.46352 -0.412789
C  -2.570696 0.691531 -0.50223
C  -4.607972 -0.408167 0.145859
C  -3.071845 1.892746 -0.020858
C  -5.110539 0.802998 0.598923
C  -4.347945 1.95495 0.52618
C  -1.011063 3.03766 -0.072032
C  -0.32998 3.684304 -1.091044
C  -0.319044 2.430343 0.968576
C  1.056667 3.727209 -1.064877
C  1.065864 2.474222 0.978836
C  1.758971 3.119747 -0.035779
H  1.000879 -1.412643 -0.737364
H  0.340869 -2.412859 2.120189
H  3.120068 -4.236903 0.661181
H  2.420161 -3.545408 2.119248
H  1.774905 -5.043141 1.46797
H  1.718651 -4.373104 -1.465902
H  0.293766 -5.010474 -0.651357
H  0.185163 -3.525056 -1.594406
H  2.494136 -1.193055 1.9635
H  -2.778205 -1.731731 -2.048555
H  -3.437469 -2.594407 -0.656225
H  -1.581138 0.653129 -0.941059
H  -5.19828 -1.31045 0.240008
H  -6.099793 0.846327 1.034796
H  -4.727181 2.899943 0.89184
H  -0.887005 4.1526 -1.89186
H  -0.858374 1.931742 1.763893
H  1.588695 4.232639 -1.859915
H  1.608288 2.005557 1.788942
H  2.839837 3.146822 -0.021202
totalener: -1958.42343117 hartree
nucrepener: 2652.26166244 hartree
electener: -4610.68509361 hartree
oneelecener: -7957.61076385 hartree
twoeener: 3346.92567024 hartree
kineticenergy: 1952.62502570 hartree
xcener: -143.516894465274 hartree
chargesum: 0.0000000
charge: -0.041183 -0.051379 -0.282524 -0.343960 -0.300606 0.083984 0.070392 -0.100107 -0.240711 -0.254814 -0.223256 0.330444 0.049915 0.039191 0.050751 -0.196761 -0.164595 0.226715 -0.082575 -0.212732 0.232935 -0.199279 -0.165914 -0.094087 -0.080836 -0.166095 0.082786 0.080023 0.096337 0.071342 0.096158 0.089002 0.094409 0.089883 0.102054 0.104605 0.104925 0.122232 0.103806 0.122928 0.124219 0.124526 0.132070 0.124929 0.123526 0.127326
qa: -0.0412 -0.0514 -0.2825 -0.3440 -0.3006 0.0840 0.0704 -0.1001 -0.2407 -0.2548 -0.2233 0.3304 0.0499 0.0392 0.0508 -0.1968 -0.1646 0.2267 -0.0826 -0.2127 0.2329 -0.1993 -0.1659 -0.0941 -0.0808 -0.1661 0.0828 0.0800 0.0963 0.0713 0.0962 0.0890 0.0944 0.0899 0.1021 0.1046 0.1049 0.1222 0.1038 0.1229 0.1242 0.1245 0.1321 0.1249 0.1235 0.1273
va: 1.2830 1.2538 2.0908 2.1655 2.1069 3.7645 3.7331 3.8634 3.9183 3.9158 3.9016 4.2751 4.2265 3.8825 3.6992 3.9043 4.0190 3.8427 3.9492 4.0386 3.8162 4.0469 3.9913 3.9662 3.8471 3.9012 1.0415 1.0349 1.0031 1.0095 1.0039 1.0029 1.0016 1.0187 1.0252 0.9908 1.0084 1.0213 1.0134 0.9996 1.0133 1.0126 1.0056 0.9991 1.0055 1.0144
dispcorr: -0.027102966 hartree
energy: -1958.450534132210
dipole: -16.24593 16.52813 0.28220 -16.96476 16.24209 -0.72267 0.60656 -1.04390 -0.43733
magnitude: 0.89059 au
magnitude: 2.26370 debye
