program: Orca
programVersion: 5.0.3
elementType: Cl Cl O O O C C C C C C C C C C C C C C C C C C C C C H H H H H H H H H H H H H H H H H H H H
charge: 0
multiplicity: 1
keywords: wb97x-d3
keywords: def2-TZVPP
keywords: def2/J RIJCOSX
keywords: DEFGRID2
keywords: scfconv7
keywords: smallprint printgap noloewdin
keywords: NOSOSCF
formula: C21H20Cl2O3
InChI: InChI=1/C21H20Cl2O3/c1-21(2)17(12-18(22)23)19(21)20(24)25-13-14-7-6-10-16(11-14)26-15-8-4-3-5-9-15/h3-12,17,19H,13H2,1-2H3
46 atoms
Cl -0.04543 -0.771146 1.917662
Cl 1.666065 -1.982798 3.906442
O  -1.395192 -2.001441 -1.606479
O  0.212015 -0.54811 -2.168986
O  -1.760132 3.387011 -0.020819
C  2.162533 -2.829983 -1.239079
C  1.930548 -1.837843 -0.150963
C  0.743098 -2.468109 -0.848966
C  2.591909 -4.227449 -0.861583
C  2.750562 -2.354133 -2.544702
C  2.172182 -2.125415 1.278985
C  -0.13342 -1.564817 -1.625642
C  1.372067 -1.684675 2.241734
C  -2.409991 -1.068953 -1.993526
C  -2.61474 -0.06765 -0.892378
C  -2.120787 1.222695 -1.016898
C  -3.227123 -0.46194 0.293638
C  -2.21514 2.106172 0.051607
C  -3.338075 0.431856 1.345129
C  -2.821911 1.714294 1.235472
C  -0.57614 3.672533 -0.63689
C  0.509933 2.805648 -0.625741
C  -0.478207 4.915893 -1.246767
C  1.688845 3.191923 -1.244815
C  0.712059 5.292858 -1.84729
C  1.7993 4.431617 -1.856162
H  2.095462 -0.801179 -0.435218
H  0.212337 -3.230364 -0.290456
H  2.314601 -4.936396 -1.642577
H  3.675789 -4.278336 -0.741063
H  2.136929 -4.568635 0.068774
H  2.419362 -2.986558 -3.369929
H  2.479048 -1.328359 -2.780336
H  3.839473 -2.413928 -2.501095
H  3.0507 -2.68975 1.56871
H  -2.159753 -0.58395 -2.938208
H  -3.301328 -1.676691 -2.145739
H  -1.635378 1.525288 -1.935833
H  -3.608432 -1.470047 0.397277
H  -3.815249 0.126882 2.266873
H  -2.887993 2.41346 2.058513
H  0.444039 1.836712 -0.148302
H  -1.333011 5.579347 -1.242658
H  2.529533 2.510889 -1.244219
H  0.78399 6.263979 -2.318994
H  2.724012 4.724558 -2.334349
totalener: -1958.42349130 hartree
nucrepener: 2672.28295181 hartree
electener: -4630.70644311 hartree
oneelecener: -7998.12514257 hartree
twoeener: 3367.41869946 hartree
kineticenergy: 1952.63470903 hartree
xcener: -143.517538367425 hartree
chargesum: -0.0000000
charge: -0.035992 -0.044776 -0.259386 -0.395178 -0.299928 0.129465 -0.056761 -0.077716 -0.272394 -0.252451 -0.243980 0.328010 0.109337 0.055278 0.009442 -0.150359 -0.208777 0.246354 -0.100337 -0.206477 0.263646 -0.129115 -0.219361 -0.109995 -0.090731 -0.145706 0.105908 0.097866 0.094585 0.093618 0.085127 0.087404 0.101524 0.083239 0.119515 0.106364 0.112401 0.130945 0.108659 0.126111 0.124613 0.096352 0.122189 0.116694 0.122488 0.122286
qa: -0.0360 -0.0448 -0.2594 -0.3952 -0.2999 0.1295 -0.0568 -0.0777 -0.2724 -0.2525 -0.2440 0.3280 0.1093 0.0553 0.0094 -0.1504 -0.2088 0.2464 -0.1003 -0.2065 0.2636 -0.1291 -0.2194 -0.1100 -0.0907 -0.1457 0.1059 0.0979 0.0946 0.0936 0.0851 0.0874 0.1015 0.0832 0.1195 0.1064 0.1124 0.1309 0.1087 0.1261 0.1246 0.0964 0.1222 0.1167 0.1225 0.1223
va: 1.3202 1.2628 2.1251 2.0878 2.1154 3.7276 3.8769 3.8194 3.9097 3.8970 3.8934 4.2167 4.1909 3.8590 3.6278 3.9135 3.9899 3.8270 3.8967 4.0212 3.8001 3.9262 4.0275 3.9610 3.9379 3.9629 1.0216 1.0270 1.0065 1.0006 1.0009 1.0022 1.0224 1.0022 1.0164 1.0111 0.9929 1.0188 1.0161 0.9999 1.0132 1.0183 1.0153 1.0006 0.9991 1.0008
dispcorr: -0.027025756 hartree
energy: -1958.450517051705
dipole: 7.03196 -6.75776 0.27419 -2.68595 1.74360 -0.94234 -25.52004 25.21477 -0.30528
magnitude: 1.02781 au
magnitude: 2.61248 debye
