program: Orca
programVersion: 5.0.3
elementType: Cl Cl O O O C C C C C C C C C C C C C C C C C C C C C H H H H H H H H H H H H H H H H H H H H
charge: 0
multiplicity: 1
keywords: wb97x-d3
keywords: def2-TZVPP
keywords: def2/J RIJCOSX
keywords: DEFGRID2
keywords: scfconv7
keywords: smallprint printgap noloewdin
keywords: NOSOSCF
formula: C21H20Cl2O3
InChI: InChI=1/C21H20Cl2O3/c1-21(2)17(12-18(22)23)19(21)20(24)25-13-14-7-6-10-16(11-14)26-15-8-4-3-5-9-15/h3-12,17,19H,13H2,1-2H3
46 atoms
Cl 2.662396 -5.22442 0.570749
Cl 4.500372 -5.232263 -1.653138
O  -1.337421 -0.904595 -1.969521
O  -1.145633 -2.108237 -0.093228
O  -1.056095 3.3186 0.633332
C  1.799797 -0.940506 -0.467249
C  1.740127 -2.440788 -0.565634
C  0.798767 -1.601613 -1.393543
C  2.926639 -0.186638 -1.132743
C  1.348335 -0.302242 0.824717
C  2.794545 -3.220345 -1.224135
C  -0.644099 -1.598257 -1.056372
C  3.249263 -4.398933 -0.816491
C  -2.69448 -0.624181 -1.648036
C  -2.806774 0.369818 -0.523651
C  -1.923821 1.439992 -0.453791
C  -3.799908 0.240488 0.43701
C  -2.016993 2.353415 0.584549
C  -3.902037 1.173581 1.457581
C  -3.010901 2.230097 1.548577
C  -1.351179 4.572429 1.082387
C  -2.510157 5.241605 0.707202
C  -0.409937 5.193704 1.890769
C  -2.719883 6.537018 1.154293
C  -0.627828 6.493377 2.321098
C  -1.784444 7.168806 1.961494
H  1.267666 -2.927117 0.279878
H  1.016541 -1.497981 -2.451406
H  3.193525 -0.585675 -2.110707
H  2.645406 0.857368 -1.278479
H  3.823033 -0.205393 -0.510833
H  2.193727 -0.231761 1.511342
H  0.976815 0.709666 0.651698
H  0.562124 -0.862178 1.325543
H  3.25147 -2.815452 -2.118915
H  -3.117132 -0.216132 -2.567169
H  -3.238752 -1.539764 -1.406225
H  -1.14096 1.56585 -1.192014
H  -4.480286 -0.600785 0.403608
H  -4.670258 1.063352 2.211376
H  -3.08194 2.935829 2.365958
H  -3.239354 4.760511 0.067596
H  0.48792 4.658487 2.171055
H  -3.621475 7.057876 0.860158
H  0.110104 6.976207 2.948281
H  -1.9541 8.180796 2.303375
totalener: -1958.42550060 hartree
nucrepener: 2459.44399152 hartree
electener: -4417.86949212 hartree
oneelecener: -7572.06605242 hartree
twoeener: 3154.19656030 hartree
kineticenergy: 1952.61623428 hartree
xcener: -143.514014430010 hartree
chargesum: -0.0000000
charge: -0.040927 -0.050882 -0.271613 -0.356116 -0.305881 0.068697 0.044766 -0.056636 -0.253599 -0.245799 -0.206866 0.300709 0.052792 0.067941 0.097562 -0.329919 -0.168648 0.288947 -0.094314 -0.188861 0.239198 -0.164468 -0.207349 -0.120727 -0.096384 -0.140091 0.082353 0.077869 0.072755 0.094314 0.099661 0.094773 0.080680 0.102977 0.094630 0.106216 0.104627 0.124171 0.105407 0.126226 0.134806 0.133389 0.124228 0.127388 0.125928 0.126069
qa: -0.0409 -0.0509 -0.2716 -0.3561 -0.3059 0.0687 0.0448 -0.0566 -0.2536 -0.2458 -0.2069 0.3007 0.0528 0.0679 0.0976 -0.3299 -0.1686 0.2889 -0.0943 -0.1889 0.2392 -0.1645 -0.2073 -0.1207 -0.0964 -0.1401 0.0824 0.0779 0.0728 0.0943 0.0997 0.0948 0.0807 0.1030 0.0946 0.1062 0.1046 0.1242 0.1054 0.1262 0.1348 0.1334 0.1242 0.1274 0.1259 0.1261
va: 1.2865 1.2540 2.1152 2.1462 2.0774 3.7704 3.8409 3.8098 3.9028 3.9044 3.9292 4.3158 4.2456 3.8561 3.6244 4.0425 4.0374 3.7458 3.9551 3.9826 3.8197 3.9448 4.0360 3.9528 3.9406 3.9574 1.0541 1.0332 1.0095 1.0047 1.0024 1.0025 1.0080 1.0191 1.0317 0.9891 1.0093 1.0295 1.0130 1.0003 1.0032 1.0046 1.0133 0.9999 0.9991 1.0002
dispcorr: -0.023070370 hartree
energy: -1958.448570968649
dipole: -18.18743 17.68897 -0.49845 39.86774 -38.49642 1.37132 4.74108 -5.01606 -0.27498
magnitude: 1.48478 au
magnitude: 3.77402 debye
