program: Orca
programVersion: 5.0.3
elementType: Cl Cl O O O C C C C C C C C C C C C C C C C C C C C C H H H H H H H H H H H H H H H H H H H H
charge: 0
multiplicity: 1
keywords: wb97x-d3
keywords: def2-TZVPP
keywords: def2/J RIJCOSX
keywords: DEFGRID2
keywords: scfconv7
keywords: smallprint printgap noloewdin
keywords: NOSOSCF
formula: C21H20Cl2O3
InChI: InChI=1/C21H20Cl2O3/c1-21(2)17(12-18(22)23)19(21)20(24)25-13-14-7-6-10-16(11-14)26-15-8-4-3-5-9-15/h3-12,17,19H,13H2,1-2H3
46 atoms
Cl 0.039013 -1.397778 2.099775
Cl 1.522981 -3.179417 3.828643
O  -1.172189 -1.753839 -1.758006
O  0.533023 -0.306257 -1.83063
O  -1.89957 3.64744 0.150318
C  2.272315 -2.888812 -1.344534
C  2.043874 -2.144639 -0.073449
C  0.859915 -2.504508 -0.943957
C  2.579028 -4.366171 -1.275905
C  2.968922 -2.183937 -2.482788
C  2.177407 -2.765561 1.262233
C  0.099552 -1.3956 -1.560725
C  1.354438 -2.487251 2.265326
C  -2.088531 -0.716833 -2.110558
C  -2.356548 0.174381 -0.930763
C  -2.004352 1.514174 -0.975094
C  -2.919503 -0.357242 0.225223
C  -2.200416 2.320291 0.139932
C  -3.124758 0.456019 1.327212
C  -2.760319 1.793254 1.294403
C  -0.818072 4.131968 -0.526546
C  0.380316 3.436494 -0.636847
C  -0.945425 5.403858 -1.067913
C  1.444706 4.026054 -1.301461
C  0.131451 5.983838 -1.718721
C  1.329838 5.297137 -1.84426
H  2.299978 -1.088477 -0.107626
H  0.244255 -3.326091 -0.5961
H  2.298115 -4.858702 -2.207855
H  3.647905 -4.530708 -1.125528
H  2.047839 -4.868127 -0.466396
H  2.78158 -1.113432 -2.493429
H  4.046876 -2.335817 -2.405466
H  2.647518 -2.590367 -3.443213
H  2.991658 -3.45534 1.450587
H  -1.721532 -0.143544 -2.963914
H  -2.992162 -1.243181 -2.418113
H  -1.552474 1.917102 -1.872404
H  -3.190385 -1.404667 0.266832
H  -3.563653 0.046257 2.227301
H  -2.906851 2.431347 2.155824
H  0.488204 2.44244 -0.2227
H  -1.885254 5.931337 -0.970772
H  2.374106 3.47948 -1.390798
H  0.027169 6.97622 -2.137197
H  2.167109 5.748527 -2.359006
totalener: -1958.42445159 hartree
nucrepener: 2606.34916826 hartree
electener: -4564.77361985 hartree
oneelecener: -7866.27722725 hartree
twoeener: 3301.50360741 hartree
kineticenergy: 1952.62862402 hartree
xcener: -143.515865171383 hartree
chargesum: -0.0000000
charge: -0.033227 -0.045226 -0.261524 -0.395734 -0.298816 0.124028 -0.038402 -0.109342 -0.272183 -0.252303 -0.248065 0.349455 0.100657 0.062380 0.050868 -0.166479 -0.275162 0.263859 -0.076156 -0.210860 0.277388 -0.173952 -0.229177 -0.106520 -0.083828 -0.153505 0.111166 0.097830 0.094895 0.093493 0.084888 0.101619 0.084032 0.087313 0.118429 0.100646 0.114639 0.122615 0.114904 0.128444 0.125271 0.128208 0.122220 0.125453 0.123343 0.122418
qa: -0.0332 -0.0452 -0.2615 -0.3957 -0.2988 0.1240 -0.0384 -0.1093 -0.2722 -0.2523 -0.2481 0.3495 0.1007 0.0624 0.0509 -0.1665 -0.2752 0.2639 -0.0762 -0.2109 0.2774 -0.1740 -0.2292 -0.1065 -0.0838 -0.1535 0.1112 0.0978 0.0949 0.0935 0.0849 0.1016 0.0840 0.0873 0.1184 0.1006 0.1146 0.1226 0.1149 0.1284 0.1253 0.1282 0.1222 0.1255 0.1233 0.1224
va: 1.3156 1.2613 2.1250 2.0967 2.1171 3.7274 3.8552 3.8394 3.9107 3.8974 3.9128 4.1987 4.2005 3.8556 3.6080 3.9264 3.9908 3.8303 3.8615 4.0442 3.7821 3.9380 4.0457 3.9452 3.9274 3.9663 1.0247 1.0271 1.0065 1.0009 1.0012 1.0224 1.0023 1.0021 1.0160 1.0119 0.9902 1.0166 1.0193 0.9978 1.0124 1.0149 1.0155 0.9998 0.9989 1.0009
dispcorr: -0.025143402 hartree
energy: -1958.449594994835
dipole: 7.22838 -6.92312 0.30527 3.72791 -4.56210 -0.83419 -27.22586 26.66665 -0.55921
magnitude: 1.04965 au
magnitude: 2.66800 debye
