program: Orca
programVersion: 5.0.3
elementType: Cl Cl O O O C C C C C C C C C C C C C C C C C C C C C H H H H H H H H H H H H H H H H H H H H
charge: 0
multiplicity: 1
keywords: wb97x-d3
keywords: def2-TZVPP
keywords: def2/J RIJCOSX
keywords: DEFGRID2
keywords: scfconv7
keywords: smallprint printgap noloewdin
keywords: NOSOSCF
formula: C21H20Cl2O3
InChI: InChI=1/C21H20Cl2O3/c1-21(2)17(12-18(22)23)19(21)20(24)25-13-14-7-6-10-16(11-14)26-15-8-4-3-5-9-15/h3-12,17,19H,13H2,1-2H3
46 atoms
Cl 1.03839 -0.01264 -0.336071
Cl 3.929012 0.087273 -0.289274
O  -1.626071 -2.677379 0.826659
O  -1.607655 -2.930686 -1.397891
O  -1.121794 2.311884 1.745993
C  1.172039 -4.322876 -0.87151
C  1.341192 -2.896104 -1.268609
C  0.400234 -3.244963 -0.136434
C  2.266883 -4.983999 -0.067928
C  0.471847 -5.262424 -1.821526
C  2.5612 -2.111591 -0.982486
C  -1.036157 -2.954374 -0.340333
C  2.518488 -0.845512 -0.587546
C  -2.911413 -2.058477 0.769528
C  -2.774495 -0.608371 0.3978
C  -2.035822 0.232653 1.219117
C  -3.336339 -0.110306 -0.770635
C  -1.860058 1.567571 0.879165
C  -3.165015 1.22457 -1.098057
C  -2.42676 2.072419 -0.286065
C  -0.809134 3.603617 1.416463
C  -1.621255 4.635866 1.859784
C  0.33246 3.864457 0.673563
C  -1.283025 5.945859 1.554638
C  0.660702 5.178071 0.374304
C  -0.145718 6.220055 0.809396
H  0.827734 -2.61016 -2.183506
H  0.758272 -3.02986 0.863724
H  3.037897 -5.389322 -0.726332
H  2.75026 -4.296422 0.627102
H  1.864489 -5.812728 0.516279
H  1.197379 -5.701746 -2.508514
H  -0.001508 -6.079992 -1.275143
H  -0.293803 -4.767669 -2.413666
H  3.534419 -2.566323 -1.125613
H  -3.572655 -2.582356 0.077411
H  -3.316322 -2.167583 1.775752
H  -1.579597 -0.142221 2.127548
H  -3.888361 -0.768137 -1.428473
H  -3.599837 1.615867 -2.008188
H  -2.298148 3.109267 -0.56551
H  -2.505378 4.41147 2.442238
H  0.957988 3.045336 0.34202
H  -1.912854 6.754513 1.900952
H  1.552476 5.386346 -0.20175
H  0.114543 7.243043 0.573407
totalener: -1958.42337387 hartree
nucrepener: 2620.08178094 hartree
electener: -4578.50515482 hartree
oneelecener: -7893.86419588 hartree
twoeener: 3315.35904106 hartree
kineticenergy: 1952.63712512 hartree
xcener: -143.516207091353 hartree
chargesum: -0.0000000
charge: -0.029197 -0.047028 -0.263585 -0.384516 -0.287815 0.129220 -0.023955 -0.124956 -0.270784 -0.251828 -0.257904 0.341760 0.106342 0.065782 0.050661 -0.320528 -0.121386 0.244466 -0.131999 -0.143196 0.172624 -0.138646 -0.111616 -0.130743 -0.144621 -0.108850 0.112272 0.099821 0.092730 0.085252 0.094855 0.082844 0.085495 0.103148 0.118458 0.100667 0.110900 0.111044 0.109673 0.124035 0.125810 0.125262 0.118445 0.127011 0.128419 0.126156
qa: -0.0292 -0.0470 -0.2636 -0.3845 -0.2878 0.1292 -0.0240 -0.1250 -0.2708 -0.2518 -0.2579 0.3418 0.1063 0.0658 0.0507 -0.3205 -0.1214 0.2445 -0.1320 -0.1432 0.1726 -0.1386 -0.1116 -0.1307 -0.1446 -0.1089 0.1123 0.0998 0.0927 0.0853 0.0949 0.0828 0.0855 0.1031 0.1185 0.1007 0.1109 0.1110 0.1097 0.1240 0.1258 0.1253 0.1184 0.1270 0.1284 0.1262
va: 1.3245 1.2614 2.1187 2.1133 2.0969 3.7206 3.8399 3.8525 3.9123 3.8977 3.9337 4.2204 4.1844 3.8535 3.6433 4.0298 3.9801 3.7736 3.9994 3.9100 3.8657 3.9908 3.9562 3.9443 3.9832 3.9268 1.0283 1.0271 1.0010 1.0010 1.0066 1.0023 1.0024 1.0227 1.0158 1.0126 0.9918 1.0362 1.0174 1.0014 1.0112 1.0088 1.0296 0.9998 1.0003 0.9998
dispcorr: -0.025601912 hartree
energy: -1958.448975786112
dipole: -11.05058 11.22837 0.17779 -13.49750 13.36655 -0.13095 -2.71728 2.77308 0.05579
magnitude: 0.22775 au
magnitude: 0.57889 debye
