program: Orca
programVersion: 5.0.3
elementType: Cl Cl O O O C C C C C C C C C C C C C C C C C C C C C H H H H H H H H H H H H H H H H H H H H
charge: 0
multiplicity: 1
keywords: wb97x-d3
keywords: def2-TZVPP
keywords: def2/J RIJCOSX
keywords: DEFGRID2
keywords: scfconv7
keywords: smallprint printgap noloewdin
keywords: NOSOSCF
formula: C21H20Cl2O3
InChI: InChI=1/C21H20Cl2O3/c1-21(2)17(12-18(22)23)19(21)20(24)25-13-14-7-6-10-16(11-14)26-15-8-4-3-5-9-15/h3-12,17,19H,13H2,1-2H3
46 atoms
Cl 2.491408 -5.517262 0.184211
Cl 4.386401 -5.339709 -1.983488
O  -1.168119 -0.750043 -1.955965
O  -1.097619 -2.040935 -0.129142
O  -1.031943 3.456642 0.749634
C  1.913998 -1.065269 -0.306908
C  1.779915 -2.538407 -0.578761
C  0.913076 -1.557454 -1.332696
C  3.099751 -0.298799 -0.84332
C  1.442537 -0.552606 1.032792
C  2.804835 -3.294854 -1.307524
C  -0.539568 -1.509039 -1.048529
C  3.169355 -4.547143 -1.06033
C  -2.533796 -0.449537 -1.693109
C  -2.687328 0.503763 -0.53917
C  -1.824099 1.585528 -0.412579
C  -3.703612 0.328628 0.38911
C  -1.964589 2.467472 0.64749
C  -3.849714 1.227424 1.434832
C  -2.981684 2.296668 1.579979
C  -1.384774 4.693257 1.205454
C  -2.553628 5.327692 0.801456
C  -0.494988 5.333464 2.05586
C  -2.827063 6.605331 1.264142
C  -0.776013 6.615569 2.501603
C  -1.944497 7.254716 2.115238
H  1.255027 -3.09186 0.191346
H  1.176755 -1.353802 -2.365005
H  3.388433 -0.598044 -1.850364
H  2.87116 0.767365 -0.878494
H  3.968236 -0.430582 -0.196065
H  2.270567 -0.570297 1.743299
H  1.095242 0.479635 0.952866
H  0.632613 -1.143376 1.453076
H  3.314706 -2.804538 -2.127715
H  -2.898275 0.002624 -2.616592
H  -3.10879 -1.361014 -1.515881
H  -1.024486 1.746342 -1.125367
H  -4.368729 -0.521653 0.309635
H  -4.636334 1.081094 2.16302
H  -3.089404 2.978267 2.413475
H  -3.242622 4.832798 0.129249
H  0.411821 4.826354 2.358037
H  -3.73726 7.098063 0.948724
H  -0.078714 7.112593 3.162857
H  -2.163806 8.252464 2.469953
totalener: -1958.42583101 hartree
nucrepener: 2445.62492574 hartree
electener: -4404.05075675 hartree
oneelecener: -7544.42755872 hartree
twoeener: 3140.37680197 hartree
kineticenergy: 1952.61649197 hartree
xcener: -143.513554187973 hartree
chargesum: -0.0000000
charge: -0.040667 -0.050880 -0.271999 -0.360290 -0.305397 0.069860 0.043522 -0.058677 -0.252264 -0.247279 -0.204875 0.307428 0.051616 0.070780 0.091201 -0.319926 -0.164044 0.280968 -0.096413 -0.184302 0.238822 -0.164503 -0.207650 -0.119321 -0.095799 -0.141198 0.082925 0.076727 0.072343 0.094396 0.099140 0.091588 0.084957 0.103624 0.093650 0.107129 0.103086 0.118836 0.105724 0.126469 0.134548 0.133077 0.123985 0.127385 0.125732 0.125967
qa: -0.0407 -0.0509 -0.2720 -0.3603 -0.3054 0.0699 0.0435 -0.0587 -0.2523 -0.2473 -0.2049 0.3074 0.0516 0.0708 0.0912 -0.3199 -0.1640 0.2810 -0.0964 -0.1843 0.2388 -0.1645 -0.2077 -0.1193 -0.0958 -0.1412 0.0829 0.0767 0.0723 0.0944 0.0991 0.0916 0.0850 0.1036 0.0936 0.1071 0.1031 0.1188 0.1057 0.1265 0.1345 0.1331 0.1240 0.1274 0.1257 0.1260
va: 1.2869 1.2539 2.1165 2.1426 2.0812 3.7737 3.8419 3.8094 3.9043 3.9089 3.9233 4.3066 4.2474 3.8551 3.6351 4.0459 4.0314 3.7588 3.9524 3.9739 3.8202 3.9403 4.0388 3.9500 3.9402 3.9586 1.0531 1.0343 1.0098 1.0042 1.0025 1.0024 1.0047 1.0202 1.0324 0.9887 1.0100 1.0327 1.0132 1.0004 1.0030 1.0045 1.0140 0.9999 0.9990 1.0003
dispcorr: -0.022598990 hartree
energy: -1958.448430001031
dipole: -16.89943 16.46774 -0.43170 40.41553 -39.05101 1.36452 8.02081 -8.19528 -0.17447
magnitude: 1.44177 au
magnitude: 3.66470 debye
