program: Orca
programVersion: 5.0.3
elementType: Cl Cl O O O C C C C C C C C C C C C C C C C C C C C C H H H H H H H H H H H H H H H H H H H H
charge: 0
multiplicity: 1
keywords: wb97x-d3
keywords: def2-TZVPP
keywords: def2/J RIJCOSX
keywords: DEFGRID2
keywords: scfconv7
keywords: smallprint printgap noloewdin
keywords: NOSOSCF
formula: C21H20Cl2O3
InChI: InChI=1/C21H20Cl2O3/c1-21(2)17(12-18(22)23)19(21)20(24)25-13-14-7-6-10-16(11-14)26-15-8-4-3-5-9-15/h3-12,17,19H,13H2,1-2H3
46 atoms
Cl 2.982258 -1.545051 2.480264
Cl 2.644235 -4.350849 3.061855
O  -1.457094 -1.542522 -1.708725
O  0.219073 -0.06745 -1.565772
O  -2.618428 3.755372 0.643417
C  2.065841 -2.563548 -1.813326
C  1.838026 -2.286145 -0.357267
C  0.651796 -2.40717 -1.301103
C  2.457966 -3.953497 -2.257605
C  2.721678 -1.484485 -2.64078
C  2.019808 -3.304436 0.683575
C  -0.175199 -1.202035 -1.53758
C  2.48779 -3.085606 1.906628
C  -2.391614 -0.473721 -1.843204
C  -2.567557 0.292942 -0.562193
C  -2.489981 1.677033 -0.576906
C  -2.815423 -0.374397 0.632436
C  -2.648254 2.395292 0.601485
C  -2.976167 0.350344 1.801913
C  -2.888147 1.733349 1.796678
C  -1.794489 4.46746 -0.178768
C  -2.281291 5.677738 -0.653077
C  -0.505459 4.053884 -0.494832
C  -1.473368 6.47925 -1.443708
C  0.286679 4.862118 -1.295851
C  -0.188757 6.074378 -1.773879
H  2.056752 -1.26831 -0.055303
H  0.083874 -3.328293 -1.232958
H  1.925456 -4.743283 -1.728375
H  2.247558 -4.081125 -3.320568
H  3.526515 -4.116329 -2.108227
H  3.804093 -1.62385 -2.624082
H  2.397158 -1.544998 -3.681424
H  2.506281 -0.482038 -2.281986
H  1.741642 -4.325574 0.45371
H  -2.096603 0.196048 -2.654222
H  -3.322017 -0.96308 -2.133678
H  -2.284559 2.190874 -1.507761
H  -2.876104 -1.454985 0.654046
H  -3.16304 -0.165987 2.7343
H  -3.003156 2.302672 2.709487
H  -3.286398 5.984652 -0.394727
H  -0.119595 3.110273 -0.130555
H  -1.856617 7.422907 -1.8091
H  1.288336 4.536072 -1.543224
H  0.437774 6.698759 -2.396211
totalener: -1958.42595337 hartree
nucrepener: 2492.94633199 hartree
electener: -4451.37228536 hartree
oneelecener: -7639.23372598 hartree
twoeener: 3187.86144063 hartree
kineticenergy: 1952.62045607 hartree
xcener: -143.514851181214 hartree
chargesum: -0.0000000
charge: -0.039722 -0.048660 -0.273352 -0.385594 -0.298793 0.078038 0.037393 -0.080017 -0.249687 -0.246838 -0.204362 0.350712 0.051026 0.070084 0.040058 -0.171203 -0.232292 0.253980 -0.066414 -0.224560 0.273086 -0.226766 -0.183818 -0.083764 -0.108452 -0.152234 0.086986 0.075328 0.072252 0.092952 0.098906 0.085970 0.084496 0.103122 0.095070 0.099864 0.110814 0.116323 0.115919 0.124886 0.124282 0.122633 0.138299 0.123331 0.127887 0.122829
qa: -0.0397 -0.0487 -0.2734 -0.3856 -0.2988 0.0780 0.0374 -0.0800 -0.2497 -0.2468 -0.2044 0.3507 0.0510 0.0701 0.0401 -0.1712 -0.2323 0.2540 -0.0664 -0.2246 0.2731 -0.2268 -0.1838 -0.0838 -0.1085 -0.1522 0.0870 0.0753 0.0723 0.0930 0.0989 0.0860 0.0845 0.1031 0.0951 0.0999 0.1108 0.1163 0.1159 0.1249 0.1243 0.1226 0.1383 0.1233 0.1279 0.1228
va: 1.2880 1.2562 2.1256 2.1138 2.1145 3.7496 3.8364 3.8487 3.9108 3.9109 3.9285 4.2229 4.2481 3.8549 3.6806 3.9384 4.0205 3.8486 3.9216 4.0545 3.7838 4.0467 3.9435 3.9258 3.9403 3.9645 1.0486 1.0367 1.0097 1.0041 1.0025 1.0008 1.0027 1.0253 1.0316 1.0111 0.9877 1.0143 1.0177 0.9987 1.0136 1.0153 1.0068 0.9990 0.9992 1.0010
dispcorr: -0.022025524 hartree
energy: -1958.447978894685
dipole: -8.00065 7.84050 -0.16016 10.66099 -11.32819 -0.66720 -28.91142 27.95949 -0.95193
magnitude: 1.17345 au
magnitude: 2.98267 debye
