program: Orca
programVersion: 5.0.3
elementType: Cl Cl O O O C C C C C C C C C C C C C C C C C C C C C H H H H H H H H H H H H H H H H H H H H
charge: 0
multiplicity: 1
keywords: wb97x-d3
keywords: def2-TZVPP
keywords: def2/J RIJCOSX
keywords: DEFGRID2
keywords: scfconv7
keywords: smallprint printgap noloewdin
keywords: NOSOSCF
formula: C21H20Cl2O3
InChI: InChI=1/C21H20Cl2O3/c1-21(2)17(12-18(22)23)19(21)20(24)25-13-14-7-6-10-16(11-14)26-15-8-4-3-5-9-15/h3-12,17,19H,13H2,1-2H3
46 atoms
Cl 4.861836 -2.080074 0.580924
Cl 4.808088 -4.797899 -0.388938
O  -1.587934 -1.673468 0.487785
O  0.049294 -0.20974 0.935361
O  -2.912562 3.620385 -0.541058
C  1.172561 -1.360482 -1.75261
C  1.939457 -1.90747 -0.580997
C  0.429885 -2.000974 -0.598291
C  1.159438 -2.122491 -3.056472
C  1.151567 0.13655 -1.946932
C  2.732302 -3.139809 -0.679905
C  -0.354399 -1.184394 0.357217
C  3.966455 -3.306769 -0.220724
C  -2.517651 -0.939371 1.292347
C  -3.225493 0.105166 0.476493
C  -2.715733 1.398083 0.396911
C  -4.374383 -0.230471 -0.228461
C  -3.361896 2.346093 -0.385832
C  -5.009865 0.72294 -1.009684
C  -4.511699 2.01066 -1.091665
C  -2.01688 4.137202 0.355585
C  -0.7507 4.474267 -0.093816
C  -2.385274 4.364824 1.674656
C  0.153591 5.051707 0.785771
C  -1.470312 4.933002 2.546498
C  -0.200127 5.2786 2.106769
H  2.331996 -1.152826 0.090892
H  0.001645 -2.973524 -0.814497
H  0.307238 -1.815003 -3.664058
H  2.066827 -1.919802 -3.627711
H  1.088122 -3.201337 -2.923599
H  1.240999 0.688058 -1.014888
H  1.98224 0.430889 -2.590625
H  0.226515 0.449723 -2.434679
H  2.284567 -3.997808 -1.166067
H  -3.225255 -1.685786 1.65204
H  -2.015996 -0.500201 2.155433
H  -1.812153 1.649269 0.936688
H  -4.773915 -1.235007 -0.166876
H  -5.907103 0.464145 -1.556091
H  -5.004025 2.761088 -1.696048
H  -0.482496 4.288819 -1.125563
H  -3.379401 4.102643 2.013812
H  1.141472 5.319164 0.435151
H  -1.755197 5.112085 3.574796
H  0.50876 5.72461 2.790993
totalener: -1958.42668782 hartree
nucrepener: 2481.42281643 hartree
electener: -4439.84950425 hartree
oneelecener: -7616.18768908 hartree
twoeener: 3176.33818483 hartree
kineticenergy: 1952.61813716 hartree
xcener: -143.512372763915 hartree
chargesum: -0.0000000
charge: -0.041707 -0.049489 -0.260017 -0.393863 -0.297669 0.069618 0.045941 -0.088504 -0.243059 -0.254937 -0.201962 0.362310 0.047637 0.039356 -0.021653 -0.148556 -0.193016 0.238526 -0.081483 -0.219312 0.217418 -0.171978 -0.153809 -0.106767 -0.117747 -0.123507 0.087219 0.076260 0.094868 0.097675 0.070724 0.101064 0.088483 0.089866 0.095585 0.103633 0.114957 0.144030 0.106871 0.124211 0.124686 0.121722 0.129161 0.124795 0.126306 0.126113
qa: -0.0417 -0.0495 -0.2600 -0.3939 -0.2977 0.0696 0.0459 -0.0885 -0.2431 -0.2549 -0.2020 0.3623 0.0476 0.0394 -0.0217 -0.1486 -0.1930 0.2385 -0.0815 -0.2193 0.2174 -0.1720 -0.1538 -0.1068 -0.1177 -0.1235 0.0872 0.0763 0.0949 0.0977 0.0707 0.1011 0.0885 0.0899 0.0956 0.1036 0.1150 0.1440 0.1069 0.1242 0.1247 0.1217 0.1292 0.1248 0.1263 0.1261
va: 1.2858 1.2558 2.1410 2.1052 2.1088 3.7643 3.8163 3.8732 3.9061 3.9158 3.9118 4.2396 4.2444 3.8676 3.7297 3.8321 4.0301 3.8481 3.9456 4.0424 3.8341 4.0307 3.9833 3.9442 3.9470 3.9513 1.0498 1.0359 1.0040 1.0030 1.0102 1.0217 1.0019 1.0012 1.0300 0.9966 1.0109 1.0260 1.0117 0.9987 1.0141 1.0123 1.0050 0.9996 0.9999 1.0001
dispcorr: -0.022382731 hartree
energy: -1958.449070556283
dipole: -27.85150 27.05196 -0.79954 20.08806 -20.16610 -0.07804 -8.47559 8.15406 -0.32153
magnitude: 0.86529 au
magnitude: 2.19940 debye
