program: Orca
programVersion: 5.0.3
elementType: Cl Cl O O O C C C C C C C C C C C C C C C C C C C C C H H H H H H H H H H H H H H H H H H H H
charge: 0
multiplicity: 1
keywords: wb97x-d3
keywords: def2-TZVPP
keywords: def2/J RIJCOSX
keywords: DEFGRID2
keywords: scfconv7
keywords: smallprint printgap noloewdin
keywords: NOSOSCF
formula: C21H20Cl2O3
InChI: InChI=1/C21H20Cl2O3/c1-21(2)17(12-18(22)23)19(21)20(24)25-13-14-7-6-10-16(11-14)26-15-8-4-3-5-9-15/h3-12,17,19H,13H2,1-2H3
46 atoms
Cl 1.88561 0.55674 -2.193726
Cl 4.18257 1.058782 -0.523921
O  -1.424962 -2.27743 -0.554056
O  -1.727015 -2.120216 1.652317
O  -1.79267 2.712321 -0.192963
C  1.388399 -3.323266 0.220127
C  1.410152 -1.923456 -0.320118
C  0.482525 -2.275718 0.833501
C  2.510151 -3.809007 1.107204
C  0.832302 -4.412308 -0.664356
C  2.528532 -1.00133 -0.085711
C  -0.988951 -2.228364 0.702582
C  2.816314 0.057826 -0.833356
C  -2.812663 -2.064659 -0.791021
C  -3.223823 -0.638481 -0.539327
C  -2.287044 0.385406 -0.519838
C  -4.569262 -0.341411 -0.34279
C  -2.691002 1.683614 -0.239029
C  -4.965876 0.967639 -0.118962
C  -4.028698 1.988625 -0.045968
C  -0.613583 2.581587 0.486544
C  -0.44179 1.72329 1.566948
C  0.424214 3.407127 0.072172
C  0.784894 1.692357 2.217882
C  1.638368 3.371202 0.739333
C  1.828523 2.510902 1.812267
H  0.915195 -1.807519 -1.276612
H  0.798865 -1.937958 1.814004
H  2.183452 -4.678161 1.68097
H  3.371055 -4.112703 0.508254
H  2.846024 -3.060045 1.823475
H  1.648791 -4.888819 -1.210464
H  0.342414 -5.184482 -0.067863
H  0.119395 -4.050994 -1.401886
H  3.180813 -1.190509 0.758527
H  -2.957244 -2.326771 -1.839922
H  -3.420724 -2.749242 -0.195821
H  -1.239473 0.185981 -0.70806
H  -5.306861 -1.134746 -0.358167
H  -6.013478 1.195394 0.028251
H  -4.331505 3.006877 0.161934
H  -1.242474 1.081007 1.910093
H  0.2775 4.073475 -0.768483
H  0.916201 1.021058 3.057158
H  2.442052 4.016981 0.410647
H  2.779888 2.478763 2.32589
elementType: Cl O C H
totalener: -1958.44715500 hartree
nucrepener: 2714.89062067 hartree
electener: -4673.33777567 hartree
oneelecener: -8083.80668673 hartree
twoeener: 3410.46891107 hartree
cpcmener: -0.02652265 hartree
kineticenergy: 1952.56308716 hartree
xcener: -143.513077274301 hartree
chargesum: -0.0000000
charge: -0.063058 -0.065981 -0.284791 -0.447626 -0.326682 0.085112 0.060750 -0.063180 -0.286938 -0.262169 -0.243587 0.365998 0.075030 0.069318 0.052798 -0.222086 -0.245479 0.300727 -0.104669 -0.260385 0.329036 -0.197636 -0.274109 -0.167234 -0.112190 -0.183098 0.089659 0.101012 0.100485 0.103859 0.092334 0.096340 0.101254 0.093784 0.127879 0.122059 0.119203 0.124493 0.141029 0.156856 0.144796 0.152051 0.142127 0.157976 0.153048 0.151886
qa: -0.0631 -0.0660 -0.2848 -0.4476 -0.3267 0.0851 0.0608 -0.0632 -0.2869 -0.2622 -0.2436 0.3660 0.0750 0.0693 0.0528 -0.2221 -0.2455 0.3007 -0.1047 -0.2604 0.3290 -0.1976 -0.2741 -0.1672 -0.1122 -0.1831 0.0897 0.1010 0.1005 0.1039 0.0923 0.0963 0.1013 0.0938 0.1279 0.1221 0.1192 0.1245 0.1410 0.1569 0.1448 0.1521 0.1421 0.1580 0.1530 0.1519
va: 1.2577 1.2331 2.1084 2.0513 2.0902 3.8251 3.7590 3.7815 3.9166 3.8987 3.8933 4.1874 4.1613 3.8072 3.6139 3.9484 3.9874 3.6971 3.8762 4.0248 3.6464 3.8475 3.9815 3.8532 3.8278 3.8410 1.0419 1.0250 1.0005 0.9995 1.0052 1.0003 0.9998 1.0146 1.0244 0.9928 1.0077 1.0125 1.0015 0.9886 1.0067 1.0063 1.0100 0.9921 0.9931 0.9959
dispcorr: -0.029150258 hartree
energy: -1958.476305259582
dipole: -11.29650 11.61604 0.31954 -20.61525 19.02394 -1.59131 10.39639 -10.72403 -0.32764
magnitude: 1.65581 au
magnitude: 4.20874 debye
