program: Orca
programVersion: 5.0.3
elementType: Cl Cl O O O C C C C C C C C C C C C C C C C C C C C C H H H H H H H H H H H H H H H H H H H H
charge: 0
multiplicity: 1
keywords: wb97x-d3
keywords: def2-TZVPP
keywords: def2/J RIJCOSX
keywords: DEFGRID2
keywords: scfconv7
keywords: smallprint printgap noloewdin
keywords: NOSOSCF
formula: C21H20Cl2O3
InChI: InChI=1/C21H20Cl2O3/c1-21(2)17(12-18(22)23)19(21)20(24)25-13-14-7-6-10-16(11-14)26-15-8-4-3-5-9-15/h3-12,17,19H,13H2,1-2H3
46 atoms
Cl 3.862749 0.286082 -0.722379
Cl 4.199519 0.179949 2.140785
O  -2.066568 -2.22955 -0.100618
O  -0.884475 -1.612649 -1.902294
O  -2.686596 3.029234 -0.18747
C  1.362823 -3.290512 -0.485947
C  1.577404 -1.821422 -0.257096
C  0.227441 -2.441967 0.046529
C  1.951165 -4.287007 0.483723
C  1.35518 -3.788643 -1.910062
C  2.375763 -1.308539 0.863845
C  -0.934954 -2.04928 -0.777333
C  3.344048 -0.406581 0.764904
C  -3.314916 -1.82167 -0.681809
C  -3.73067 -0.486475 -0.132001
C  -2.998626 0.656481 -0.442928
C  -4.837796 -0.385517 0.702268
C  -3.361959 1.87806 0.104232
C  -5.211422 0.848388 1.217698
C  -4.470855 1.983931 0.933428
C  -1.319806 3.01612 -0.269838
C  -0.738037 3.778589 -1.272227
C  -0.531109 2.322414 0.641249
C  0.645326 3.849356 -1.360126
C  0.850005 2.393525 0.533901
C  1.445068 3.153644 -0.464673
H  1.608577 -1.2265 -1.16308
H  -0.000721 -2.597089 1.09523
H  1.868372 -3.972596 1.523675
H  1.441055 -5.247669 0.392414
H  3.008245 -4.452619 0.267261
H  2.3575 -4.122253 -2.184199
H  0.6845 -4.643198 -2.018903
H  1.055837 -3.031703 -2.630951
H  2.153346 -1.67842 1.857853
H  -3.248377 -1.803716 -1.769791
H  -4.034632 -2.589972 -0.402231
H  -2.152115 0.597193 -1.115922
H  -5.411477 -1.270439 0.948484
H  -6.077128 0.924616 1.862711
H  -4.747891 2.945457 1.347162
H  -1.364312 4.317027 -1.972721
H  -0.981784 1.735591 1.431963
H  1.09693 4.447679 -2.141009
H  1.462661 1.858268 1.247858
H  2.522715 3.205158 -0.541065
elementType: Cl O C H
totalener: -1958.44902550 hartree
nucrepener: 2605.00276590 hartree
electener: -4563.45179140 hartree
oneelecener: -7863.85679689 hartree
twoeener: 3300.40500549 hartree
cpcmener: -0.02424882 hartree
kineticenergy: 1952.56241340 hartree
xcener: -143.506485004056 hartree
chargesum: -0.0000000
charge: -0.056812 -0.066842 -0.282180 -0.470494 -0.331438 0.095564 0.023367 -0.079654 -0.260538 -0.270915 -0.207089 0.405105 0.045631 0.087874 -0.015669 -0.164970 -0.225167 0.245986 -0.107985 -0.247212 0.291115 -0.253333 -0.189324 -0.119362 -0.143164 -0.189882 0.082940 0.094816 0.089192 0.098464 0.100342 0.095918 0.100430 0.094595 0.132369 0.119470 0.111882 0.153229 0.143292 0.157525 0.146235 0.144843 0.151667 0.156848 0.166595 0.146737
qa: -0.0568 -0.0668 -0.2822 -0.4705 -0.3314 0.0956 0.0234 -0.0797 -0.2605 -0.2709 -0.2071 0.4051 0.0456 0.0879 -0.0157 -0.1650 -0.2252 0.2460 -0.1080 -0.2472 0.2911 -0.2533 -0.1893 -0.1194 -0.1432 -0.1899 0.0829 0.0948 0.0892 0.0985 0.1003 0.0959 0.1004 0.0946 0.1324 0.1195 0.1119 0.1532 0.1433 0.1575 0.1462 0.1448 0.1517 0.1568 0.1666 0.1467
va: 1.2675 1.2317 2.1338 2.0294 2.0747 3.7491 3.8305 3.8667 3.9100 3.9049 3.8891 4.1668 4.1794 3.8024 3.7312 3.8779 3.9720 3.7790 3.8918 4.0181 3.6820 4.0223 3.9058 3.9178 3.8474 3.9151 1.0460 1.0359 1.0045 1.0021 1.0012 1.0005 0.9990 1.0198 1.0150 1.0172 1.0014 1.0182 1.0036 0.9888 1.0063 1.0082 1.0014 0.9894 0.9811 1.0074
dispcorr: -0.025363719 hartree
energy: -1958.474389216453
dipole: -18.74420 18.15050 -0.59370 -16.55863 14.98194 -1.57668 -5.24752 6.13843 0.89092
magnitude: 1.90582 au
magnitude: 4.84421 debye
