program: Orca
programVersion: 5.0.3
elementType: Cl Cl O O O C C C C C C C C C C C C C C C C C C C C C H H H H H H H H H H H H H H H H H H H H
charge: 0
multiplicity: 1
keywords: wb97x-d3
keywords: def2-TZVPP
keywords: def2/J RIJCOSX
keywords: DEFGRID2
keywords: scfconv7
keywords: smallprint printgap noloewdin
keywords: NOSOSCF
formula: C21H20Cl2O3
InChI: InChI=1/C21H20Cl2O3/c1-21(2)17(12-18(22)23)19(21)20(24)25-13-14-7-6-10-16(11-14)26-15-8-4-3-5-9-15/h3-12,17,19H,13H2,1-2H3
46 atoms
Cl 4.902855 -2.440064 -1.865158
Cl 5.166536 -5.100015 -0.780651
O  -0.417749 -1.238029 1.488272
O  0.723285 -0.123915 -0.076327
O  -3.090354 3.864319 -0.127708
C  0.460892 -2.966505 -1.466778
C  1.874135 -2.703623 -1.02497
C  0.736219 -2.521941 -0.044632
C  -0.030558 -4.38376 -1.63498
C  -0.146999 -2.010829 -2.463833
C  2.830244 -3.791945 -0.789544
C  0.376144 -1.167114 0.420588
C  4.119531 -3.76914 -1.102394
C  -0.951198 -0.015125 1.993833
C  -1.985311 0.578506 1.077879
C  -2.025569 1.955642 0.903358
C  -2.920496 -0.229253 0.436421
C  -3.020776 2.523286 0.116319
C  -3.889064 0.347637 -0.370389
C  -3.954488 1.723958 -0.526874
C  -2.782088 4.782893 0.836193
C  -2.169249 5.952147 0.405852
C  -3.119186 4.612533 2.174087
C  -1.891613 6.956807 1.320812
C  -2.822773 5.621394 3.079884
C  -2.209783 6.79497 2.66224
H  2.297126 -1.78049 -1.404534
H  0.613756 -3.298675 0.70236
H  0.333224 -5.061034 -0.86313
H  -1.12126 -4.408013 -1.596952
H  0.275202 -4.784611 -2.603454
H  0.277359 -1.010221 -2.418325
H  0.016051 -2.387715 -3.475411
H  -1.225648 -1.927397 -2.314241
H  2.465093 -4.691528 -0.308499
H  -1.404372 -0.290047 2.947145
H  -0.154237 0.70147 2.203291
H  -1.276456 2.576763 1.380521
H  -2.900252 -1.304563 0.561296
H  -4.614551 -0.278921 -0.873039
H  -4.71733 2.175467 -1.148626
H  -1.918472 6.073863 -0.640592
H  -3.613248 3.711209 2.514526
H  -1.41615 7.867577 0.980104
H  -3.083632 5.487202 4.121897
H  -1.986521 7.577679 3.375071
elementType: Cl O C H
totalener: -1958.45001569 hartree
nucrepener: 2417.67419984 hartree
electener: -4376.12421553 hartree
oneelecener: -7489.20836695 hartree
twoeener: 3113.08415141 hartree
cpcmener: -0.02673537 hartree
kineticenergy: 1952.56771254 hartree
xcener: -143.508177615011 hartree
chargesum: -0.0000000
charge: -0.055786 -0.062035 -0.286190 -0.452841 -0.326457 0.089763 0.025011 -0.065810 -0.267010 -0.263990 -0.201654 0.375115 0.040208 0.098199 0.052657 -0.224424 -0.276234 0.296381 -0.100354 -0.262302 0.303054 -0.258291 -0.207334 -0.115740 -0.140311 -0.191997 0.076346 0.096094 0.090468 0.097982 0.101219 0.094982 0.100947 0.093753 0.127975 0.122341 0.115794 0.141767 0.141195 0.157181 0.146137 0.145330 0.155390 0.157364 0.158862 0.157240
qa: -0.0558 -0.0620 -0.2862 -0.4528 -0.3265 0.0898 0.0250 -0.0658 -0.2670 -0.2640 -0.2017 0.3751 0.0402 0.0982 0.0527 -0.2244 -0.2762 0.2964 -0.1004 -0.2623 0.3031 -0.2583 -0.2073 -0.1157 -0.1403 -0.1920 0.0763 0.0961 0.0905 0.0980 0.1012 0.0950 0.1009 0.0938 0.1280 0.1223 0.1158 0.1418 0.1412 0.1572 0.1461 0.1453 0.1554 0.1574 0.1589 0.1572
va: 1.2701 1.2427 2.1198 2.0566 2.0819 3.7384 3.8864 3.8038 3.9058 3.9006 3.8985 4.2265 4.2110 3.7983 3.6014 3.9671 3.9531 3.7034 3.8812 4.0253 3.6836 4.0110 3.9143 3.8806 3.8892 3.9120 1.0509 1.0332 1.0056 1.0015 1.0011 1.0187 1.0012 1.0023 1.0194 0.9909 1.0106 1.0081 1.0130 0.9888 1.0071 1.0090 0.9978 0.9892 0.9902 0.9909
dispcorr: -0.022071025 hartree
energy: -1958.472086712633
dipole: -35.55011 34.09872 -1.45139 14.90692 -15.73759 -0.83067 4.63935 -3.65303 0.98632
magnitude: 1.94149 au
magnitude: 4.93487 debye
