program: Orca
programVersion: 5.0.3
elementType: Cl Cl O O O C C C C C C C C C C C C C C C C C C C C C H H H H H H H H H H H H H H H H H H H H
charge: 0
multiplicity: 1
keywords: wb97x-d3
keywords: def2-TZVPP
keywords: def2/J RIJCOSX
keywords: DEFGRID2
keywords: scfconv7
keywords: smallprint printgap noloewdin
keywords: NOSOSCF
formula: C21H20Cl2O3
InChI: InChI=1/C21H20Cl2O3/c1-21(2)17(12-18(22)23)19(21)20(24)25-13-14-7-6-10-16(11-14)26-15-8-4-3-5-9-15/h3-12,17,19H,13H2,1-2H3
46 atoms
Cl 2.132747 0.22128 -2.595307
Cl 4.361538 0.67581 -0.822882
O  -1.685818 -2.028932 1.319832
O  -1.523883 -2.495666 -0.857332
O  -2.209338 3.006484 0.360278
C  1.325656 -3.52277 -0.07531
C  1.413732 -2.133243 -0.631524
C  0.445287 -2.436432 0.504416
C  2.414546 -4.035064 0.837972
C  0.752866 -4.601703 -0.961041
C  2.568088 -1.263506 -0.383126
C  -1.001337 -2.337611 0.219047
C  2.956907 -0.263462 -1.164335
C  -3.084522 -1.76272 1.168023
C  -3.326049 -0.491176 0.404067
C  -2.643269 0.664523 0.771779
C  -4.216129 -0.461431 -0.66087
C  -2.831408 1.833069 0.047933
C  -4.422254 0.722571 -1.355563
C  -3.724502 1.869863 -1.016779
C  -0.982446 3.01347 0.967513
C  -0.796531 3.925233 1.996671
C  0.061655 2.198305 0.544922
C  0.444428 4.021334 2.610381
C  1.291414 2.294744 1.179137
C  1.490123 3.201244 2.211837
H  0.931094 -2.00352 -1.593387
H  0.734189 -2.086957 1.489083
H  3.28382 -4.353875 0.259511
H  2.748421 -3.297918 1.56737
H  2.055985 -4.900571 1.397743
H  0.234079 -5.356543 -0.366951
H  0.059626 -4.22457 -1.708625
H  1.564653 -5.102702 -1.491625
H  3.164423 -1.445577 0.502758
H  -3.591817 -2.606501 0.696312
H  -3.456804 -1.680335 2.189169
H  -1.965487 0.643832 1.616676
H  -4.739729 -1.362567 -0.954743
H  -5.114748 0.747706 -2.186989
H  -3.867335 2.78949 -1.57036
H  -1.617408 4.559052 2.3083
H  -0.072859 1.496631 -0.26917
H  0.587846 4.737314 3.409279
H  2.103645 1.657578 0.856176
H  2.454735 3.270338 2.697115
elementType: Cl O C H
totalener: -1958.44936497 hartree
nucrepener: 2624.88101776 hartree
electener: -4583.33038273 hartree
oneelecener: -7903.61248488 hartree
twoeener: 3320.28210216 hartree
cpcmener: -0.02537529 hartree
kineticenergy: 1952.56987739 hartree
xcener: -143.509659392988 hartree
chargesum: 0.0000000
charge: -0.058263 -0.066892 -0.289428 -0.459933 -0.327971 0.088861 0.029013 -0.060265 -0.279361 -0.268885 -0.204794 0.385461 0.048687 0.100577 0.030937 -0.257593 -0.225051 0.305667 -0.105009 -0.264618 0.304681 -0.259575 -0.218896 -0.107037 -0.097010 -0.212048 0.080833 0.096844 0.104142 0.092761 0.099105 0.099470 0.095002 0.095854 0.129039 0.113206 0.124479 0.139526 0.141253 0.156662 0.145334 0.144731 0.145000 0.157071 0.153098 0.155331
qa: -0.0583 -0.0669 -0.2894 -0.4599 -0.3280 0.0889 0.0290 -0.0603 -0.2794 -0.2689 -0.2048 0.3855 0.0487 0.1006 0.0309 -0.2576 -0.2251 0.3057 -0.1050 -0.2646 0.3047 -0.2596 -0.2189 -0.1070 -0.0970 -0.2120 0.0808 0.0968 0.1041 0.0928 0.0991 0.0995 0.0950 0.0959 0.1290 0.1132 0.1245 0.1395 0.1413 0.1567 0.1453 0.1447 0.1450 0.1571 0.1531 0.1553
va: 1.2629 1.2348 2.1183 2.0477 2.0876 3.7786 3.8335 3.7943 3.9140 3.8993 3.8907 4.1886 4.1886 3.8018 3.6349 3.9279 3.9610 3.7087 3.8913 4.0100 3.7210 4.0186 3.9377 3.8742 3.8092 3.9710 1.0509 1.0317 0.9996 1.0048 1.0011 0.9993 1.0208 1.0000 1.0204 1.0085 0.9923 1.0156 1.0044 0.9890 1.0076 1.0087 1.0054 0.9886 1.0019 0.9935
dispcorr: -0.025431595 hartree
energy: -1958.474796560416
dipole: -12.87815 13.14438 0.26623 -18.35717 17.16230 -1.19487 13.41341 -11.91585 1.49756
magnitude: 1.93424 au
magnitude: 4.91644 debye
