program: Orca
programVersion: 5.0.3
elementType: Cl Cl O O O C C C C C C C C C C C C C C C C C C C C C H H H H H H H H H H H H H H H H H H H H
charge: 0
multiplicity: 1
keywords: wb97x-d3
keywords: def2-TZVPP
keywords: def2/J RIJCOSX
keywords: DEFGRID2
keywords: scfconv7
keywords: smallprint printgap noloewdin
keywords: NOSOSCF
formula: C21H20Cl2O3
InChI: InChI=1/C21H20Cl2O3/c1-21(2)17(12-18(22)23)19(21)20(24)25-13-14-7-6-10-16(11-14)26-15-8-4-3-5-9-15/h3-12,17,19H,13H2,1-2H3
46 atoms
Cl 3.888949 -1.686539 1.804328
Cl 5.167177 -3.800267 0.313068
O  -0.994047 -1.421829 0.7431
O  -1.955565 -2.957196 -0.565646
O  -3.158007 3.485878 0.008241
C  1.022828 -1.306877 -1.620749
C  1.621412 -1.904271 -0.376164
C  0.318313 -2.451352 -0.923312
C  1.614537 -1.618074 -2.974219
C  0.482419 0.100315 -1.525704
C  2.810304 -2.763839 -0.423348
C  -0.987435 -2.310174 -0.241631
C  3.810834 -2.745428 0.448255
C  -2.238425 -1.134073 1.401504
C  -3.043149 -0.134365 0.621424
C  -2.69236 1.211894 0.67917
C  -4.120381 -0.534096 -0.161523
C  -3.412475 2.145571 -0.053456
C  -4.837823 0.409425 -0.882966
C  -4.484666 1.748382 -0.841796
C  -1.875683 3.944046 0.145286
C  -1.66414 4.987362 1.034817
C  -0.829562 3.438184 -0.616811
C  -0.392423 5.52878 1.161262
C  0.439066 3.979279 -0.469386
C  0.664828 5.0238 0.417559
H  1.53275 -1.281902 0.505792
H  0.388325 -3.397869 -1.448157
H  2.497605 -1.003658 -3.159053
H  1.902799 -2.662516 -3.087406
H  0.888696 -1.397019 -3.758844
H  1.226048 0.800684 -1.910732
H  -0.420292 0.214529 -2.129507
H  0.251851 0.404258 -0.507436
H  2.882946 -3.482951 -1.230835
H  -2.801637 -2.050896 1.577766
H  -1.946579 -0.726579 2.368304
H  -1.868295 1.524059 1.310684
H  -4.404681 -1.577214 -0.203267
H  -5.67825 0.09987 -1.490497
H  -5.041708 2.485383 -1.406625
H  -2.490074 5.374827 1.618182
H  -0.999059 2.636862 -1.324975
H  -0.229927 6.346053 1.851892
H  1.254623 3.5844 -1.06149
H  1.656456 5.443315 0.5243
elementType: Cl O C H
totalener: -1958.44789622 hartree
nucrepener: 2525.24532666 hartree
electener: -4483.69322289 hartree
oneelecener: -7703.56107033 hartree
twoeener: 3219.86784745 hartree
cpcmener: -0.02571453 hartree
kineticenergy: 1952.56760507 hartree
xcener: -143.507067009440 hartree
chargesum: 0.0000000
charge: -0.057601 -0.061664 -0.271799 -0.462211 -0.330604 0.108977 0.055544 -0.092665 -0.270318 -0.309010 -0.224262 0.406296 0.044948 0.056439 0.004624 -0.240947 -0.179315 0.289279 -0.132793 -0.238742 0.286848 -0.239148 -0.214783 -0.127278 -0.148233 -0.180900 0.082225 0.095642 0.099694 0.091162 0.099656 0.105010 0.111267 0.092075 0.128585 0.117720 0.121260 0.144268 0.141279 0.157063 0.146025 0.145916 0.176348 0.157677 0.158332 0.158114
qa: -0.0576 -0.0617 -0.2718 -0.4622 -0.3306 0.1090 0.0555 -0.0927 -0.2703 -0.3090 -0.2243 0.4063 0.0449 0.0564 0.0046 -0.2409 -0.1793 0.2893 -0.1328 -0.2387 0.2868 -0.2391 -0.2148 -0.1273 -0.1482 -0.1809 0.0822 0.0956 0.0997 0.0912 0.0997 0.1050 0.1113 0.0921 0.1286 0.1177 0.1213 0.1443 0.1413 0.1571 0.1460 0.1459 0.1763 0.1577 0.1583 0.1581
va: 1.2682 1.2434 2.1259 2.0416 2.0816 3.7474 3.8241 3.8382 3.9084 3.9119 3.8953 4.2091 4.2128 3.8282 3.6308 3.9287 3.9389 3.7079 3.9303 4.0092 3.7000 4.0040 3.9066 3.8870 3.8965 3.9156 1.0418 1.0315 1.0011 1.0063 1.0004 0.9984 0.9955 1.0059 1.0199 1.0093 0.9991 1.0076 1.0164 0.9898 1.0064 1.0075 0.9821 0.9891 0.9925 0.9906
dispcorr: -0.024602231 hartree
energy: -1958.472498453060
dipole: -22.86251 23.12686 0.26435 18.38977 -17.61446 0.77531 -15.10258 14.74944 -0.35314
magnitude: 0.89202 au
magnitude: 2.26733 debye
