program: Orca
programVersion: 5.0.3
elementType: Cl Cl O O O C C C C C C C C C C C C C C C C C C C C C H H H H H H H H H H H H H H H H H H H H
charge: 0
multiplicity: 1
keywords: wb97x-d3
keywords: def2-TZVPP
keywords: def2/J RIJCOSX
keywords: DEFGRID2
keywords: scfconv7
keywords: smallprint printgap noloewdin
keywords: NOSOSCF
formula: C21H20Cl2O3
InChI: InChI=1/C21H20Cl2O3/c1-21(2)17(12-18(22)23)19(21)20(24)25-13-14-7-6-10-16(11-14)26-15-8-4-3-5-9-15/h3-12,17,19H,13H2,1-2H3
46 atoms
Cl 5.002531 -2.051089 -0.897641
Cl 5.117411 -4.886722 -0.381709
O  -1.005116 -1.532422 1.263644
O  0.457876 -0.141256 0.306615
O  -2.959278 3.693328 -0.439942
C  0.645584 -2.574522 -1.702658
C  1.881396 -2.452083 -0.855813
C  0.520159 -2.481676 -0.194904
C  0.287702 -3.904955 -2.319278
C  0.272237 -1.401795 -2.575648
C  2.794348 -3.581056 -0.643565
C  0.018293 -1.255193 0.459809
C  4.11929 -3.505962 -0.63998
C  -1.654068 -0.430162 1.908661
C  -2.5334 0.324663 0.952638
C  -2.312757 1.675579 0.721489
C  -3.570755 -0.331446 0.2951
C  -3.147049 2.374229 -0.143658
C  -4.381349 0.370098 -0.582941
C  -4.181987 1.72547 -0.801648
C  -2.453621 4.550742 0.499716
C  -1.48365 5.451107 0.082352
C  -2.927821 4.572659 1.805963
C  -0.985684 6.383404 0.982224
C  -2.411181 5.500855 2.69786
C  -1.440557 6.408711 2.292925
H  2.346929 -1.473754 -0.881875
H  0.235277 -3.405922 0.296106
H  0.453633 -4.748228 -1.649931
H  -0.766337 -3.917253 -2.600768
H  0.872661 -4.076784 -3.224386
H  0.703162 -1.533014 -3.56861
H  -0.810034 -1.335894 -2.693895
H  0.626024 -0.448129 -2.193249
H  2.361934 -4.559053 -0.467222
H  -2.248835 -0.887645 2.697797
H  -0.92283 0.226782 2.381399
H  -1.488332 2.174467 1.216552
H  -3.748929 -1.385469 0.470901
H  -5.188827 -0.136852 -1.09532
H  -4.821645 2.276443 -1.479785
H  -1.125824 5.424216 -0.939678
H  -3.692584 3.87691 2.129517
H  -0.231287 7.08767 0.65415
H  -2.778007 5.515451 3.71595
H  -1.044604 7.132103 2.993805
elementType: Cl O C H
totalener: -1958.45043611 hartree
nucrepener: 2437.08606913 hartree
electener: -4395.53650524 hartree
oneelecener: -7528.26069779 hartree
twoeener: 3132.72419256 hartree
cpcmener: -0.02576710 hartree
kineticenergy: 1952.57865990 hartree
xcener: -143.508941696243 hartree
chargesum: -0.0000000
charge: -0.056391 -0.062142 -0.283851 -0.460310 -0.328829 0.087023 0.030391 -0.081874 -0.265701 -0.265488 -0.207790 0.394469 0.042792 0.091663 0.004814 -0.167667 -0.255951 0.272965 -0.108987 -0.255323 0.280244 -0.243464 -0.192564 -0.122183 -0.142524 -0.184236 0.077625 0.096960 0.090591 0.097759 0.101164 0.098043 0.097913 0.094424 0.129974 0.127124 0.113704 0.136205 0.141095 0.156851 0.146150 0.145687 0.155591 0.157179 0.159039 0.157837
qa: -0.0564 -0.0621 -0.2839 -0.4603 -0.3288 0.0870 0.0304 -0.0819 -0.2657 -0.2655 -0.2078 0.3945 0.0428 0.0917 0.0048 -0.1677 -0.2560 0.2730 -0.1090 -0.2553 0.2802 -0.2435 -0.1926 -0.1222 -0.1425 -0.1842 0.0776 0.0970 0.0906 0.0978 0.1012 0.0980 0.0979 0.0944 0.1300 0.1271 0.1137 0.1362 0.1411 0.1569 0.1461 0.1457 0.1556 0.1572 0.1590 0.1578
va: 1.2693 1.2430 2.1280 2.0509 2.0779 3.7357 3.8614 3.8267 3.9063 3.9043 3.9000 4.2129 4.2101 3.8035 3.6328 3.8873 3.9675 3.7314 3.8896 4.0171 3.6980 4.0106 3.9169 3.8830 3.8890 3.9049 1.0519 1.0325 1.0054 1.0017 1.0008 1.0008 1.0003 1.0191 1.0181 0.9920 1.0106 1.0167 1.0089 0.9889 1.0068 1.0078 0.9970 0.9893 0.9901 0.9906
dispcorr: -0.021905618 hartree
energy: -1958.472341723559
dipole: -33.82138 32.30948 -1.51189 14.73067 -15.55318 -0.82251 -2.05074 2.49820 0.44746
magnitude: 1.77836 au
magnitude: 4.52023 debye
