program: Orca
programVersion: 5.0.3
elementType: Cl Cl O O O C C C C C C C C C C C C C C C C C C C C C H H H H H H H H H H H H H H H H H H H H
charge: 0
multiplicity: 1
keywords: wb97x-d3
keywords: def2-TZVPP
keywords: def2/J RIJCOSX
keywords: DEFGRID2
keywords: scfconv7
keywords: smallprint printgap noloewdin
keywords: NOSOSCF
formula: C21H20Cl2O3
InChI: InChI=1/C21H20Cl2O3/c1-21(2)17(12-18(22)23)19(21)20(24)25-13-14-7-6-10-16(11-14)26-15-8-4-3-5-9-15/h3-12,17,19H,13H2,1-2H3
46 atoms
Cl 3.993507 -0.757461 1.252688
Cl 5.265946 -3.256363 0.568042
O  -1.082333 -1.433421 1.026497
O  -2.083497 -3.11524 -0.053698
O  -3.000495 3.437269 -0.379897
C  0.779431 -1.740706 -1.502976
C  1.470878 -1.959957 -0.181702
C  0.195246 -2.705507 -0.49225
C  1.350921 -2.348293 -2.760284
C  0.131984 -0.39665 -1.732633
C  2.725306 -2.720182 -0.092532
C  -1.102055 -2.448271 0.173702
C  3.836748 -2.296266 0.494833
C  -2.32309 -1.00052 1.610453
C  -3.05721 -0.0815 0.676452
C  -2.664129 1.251789 0.595514
C  -4.098091 -0.544441 -0.121515
C  -3.3019 2.108683 -0.291121
C  -4.734074 0.323887 -0.997728
C  -4.335828 1.647229 -1.095717
C  -1.716125 3.869173 -0.182747
C  -0.637243 3.263398 -0.815293
C  -1.531283 4.980872 0.625666
C  0.63719 3.77413 -0.618688
C  -0.251997 5.490994 0.801383
C  0.836493 4.887204 0.188155
H  1.379559 -1.133972 0.513632
H  0.304969 -3.75038 -0.76333
H  0.584057 -2.399535 -3.535453
H  2.168649 -1.736039 -3.145663
H  1.730559 -3.358792 -2.61268
H  -0.146632 0.106275 -0.808836
H  0.825999 0.259206 -2.262054
H  -0.764397 -0.493523 -2.348906
H  2.755401 -3.706824 -0.539972
H  -2.934648 -1.85587 1.898833
H  -2.028254 -0.475467 2.517741
H  -1.866802 1.613201 1.234817
H  -4.416569 -1.57638 -0.057209
H  -5.544764 -0.034054 -1.618948
H  -4.828486 2.323992 -1.782589
H  -0.786211 2.406988 -1.461217
H  -2.382009 5.445423 1.108529
H  1.478151 3.300623 -1.10912
H  -0.109295 6.360701 1.429741
H  1.832975 5.283047 0.334017
elementType: Cl O C H
totalener: -1958.44762170 hartree
nucrepener: 2541.31968633 hartree
electener: -4499.76730803 hartree
oneelecener: -7735.72256265 hartree
twoeener: 3235.95525462 hartree
cpcmener: -0.02542602 hartree
kineticenergy: 1952.56493021 hartree
xcener: -143.506038214945 hartree
chargesum: -0.0000000
charge: -0.057975 -0.060453 -0.269139 -0.459726 -0.330596 0.106166 0.057211 -0.110721 -0.264147 -0.284371 -0.223649 0.401645 0.041180 0.052101 -0.005465 -0.238386 -0.178953 0.293914 -0.130830 -0.239953 0.271315 -0.208617 -0.227504 -0.160895 -0.131482 -0.170685 0.085337 0.099380 0.099341 0.099859 0.090390 0.077445 0.103757 0.108135 0.131600 0.118786 0.121446 0.143494 0.142623 0.157198 0.146403 0.189419 0.144896 0.154506 0.157813 0.158187
qa: -0.0580 -0.0605 -0.2691 -0.4597 -0.3306 0.1062 0.0572 -0.1107 -0.2641 -0.2844 -0.2236 0.4016 0.0412 0.0521 -0.0055 -0.2384 -0.1790 0.2939 -0.1308 -0.2400 0.2713 -0.2086 -0.2275 -0.1609 -0.1315 -0.1707 0.0853 0.0994 0.0993 0.0999 0.0904 0.0774 0.1038 0.1081 0.1316 0.1188 0.1214 0.1435 0.1426 0.1572 0.1464 0.1894 0.1449 0.1545 0.1578 0.1582
va: 1.2674 1.2452 2.1281 2.0422 2.0820 3.7477 3.8036 3.8647 3.9014 3.9098 3.8813 4.2144 4.2064 3.8283 3.6254 3.9148 3.9329 3.6978 3.9325 4.0065 3.7285 3.9078 3.9997 3.9132 3.8874 3.9005 1.0400 1.0313 1.0012 1.0017 1.0047 1.0078 0.9998 0.9975 1.0162 1.0092 0.9990 1.0084 1.0169 0.9896 1.0065 0.9692 1.0075 0.9952 0.9892 0.9901
dispcorr: -0.024879999 hartree
energy: -1958.472501699785
dipole: -24.60705 24.77524 0.16819 11.25625 -10.74961 0.50663 -14.31938 14.02279 -0.29659
magnitude: 0.61068 au
magnitude: 1.55223 debye
