program: Orca
programVersion: 5.0.3
elementType: Cl Cl O O O C C C C C C C C C C C C C C C C C C C C C H H H H H H H H H H H H H H H H H H H H
charge: 0
multiplicity: 1
keywords: wb97x-d3
keywords: def2-TZVPP
keywords: def2/J RIJCOSX
keywords: DEFGRID2
keywords: scfconv7
keywords: smallprint printgap noloewdin
keywords: NOSOSCF
formula: C21H20Cl2O3
InChI: InChI=1/C21H20Cl2O3/c1-21(2)17(12-18(22)23)19(21)20(24)25-13-14-7-6-10-16(11-14)26-15-8-4-3-5-9-15/h3-12,17,19H,13H2,1-2H3
46 atoms
Cl 5.105595 -3.349878 -0.313304
Cl 4.452617 -6.129603 -0.731264
O  -0.954432 -1.786165 0.98782
O  0.915466 -0.600016 0.691867
O  -1.878251 4.054607 1.508619
C  0.991189 -2.409254 -1.901765
C  2.043505 -2.841536 -0.918049
C  0.610351 -2.67912 -0.459068
C  0.45693 -3.384621 -2.922918
C  1.061469 -0.995086 -2.423832
C  2.61657 -4.192499 -0.934722
C  0.248847 -1.577036 0.454375
C  3.882782 -4.502995 -0.687358
C  -1.504586 -0.748715 1.798359
C  -1.869171 0.471504 0.999056
C  -1.734407 1.723918 1.581112
C  -2.37823 0.366526 -0.292376
C  -2.097031 2.864996 0.878152
C  -2.721584 1.514386 -0.990366
C  -2.584123 2.77137 -0.419115
C  -2.671589 5.140791 1.260908
C  -4.056302 5.046581 1.187312
C  -2.039771 6.371291 1.154913
C  -4.803524 6.199122 0.992862
C  -2.80114 7.517473 0.974505
C  -4.183511 7.437084 0.885244
H  2.713347 -2.049643 -0.601658
H  0.048341 -3.59331 -0.304557
H  1.135947 -3.457867 -3.775325
H  0.308978 -4.387952 -2.525365
H  -0.508705 -3.040546 -3.299084
H  1.621342 -0.981305 -3.361555
H  0.061917 -0.606808 -2.632858
H  1.554809 -0.30586 -1.741371
H  1.952895 -5.019676 -1.156376
H  -2.395846 -1.193823 2.243107
H  -0.824369 -0.491144 2.613375
H  -1.332498 1.820345 2.583196
H  -2.503477 -0.599914 -0.763693
H  -3.10266 1.433653 -2.000277
H  -2.846691 3.654423 -0.987072
H  -4.554688 4.090386 1.28531
H  -0.96065 6.431052 1.219131
H  -5.881882 6.12502 0.933968
H  -2.305685 8.476448 0.895039
H  -4.773958 8.331548 0.737105
elementType: Cl O C H
totalener: -1958.45006113 hartree
nucrepener: 2396.62488152 hartree
electener: -4355.07494265 hartree
oneelecener: -7447.15154309 hartree
twoeener: 3092.07660044 hartree
cpcmener: -0.02693518 hartree
kineticenergy: 1952.56449152 hartree
xcener: -143.507913611908 hartree
chargesum: -0.0000000
charge: -0.056094 -0.062083 -0.288189 -0.451589 -0.326074 0.089636 0.027425 -0.061099 -0.267755 -0.265772 -0.202369 0.368118 0.039674 0.101340 0.069459 -0.280266 -0.270685 0.297474 -0.119334 -0.216385 0.290199 -0.199650 -0.247962 -0.143025 -0.121666 -0.185039 0.077816 0.096138 0.101185 0.091079 0.097555 0.101258 0.093583 0.096640 0.127721 0.121032 0.115791 0.128734 0.143223 0.158513 0.155220 0.156639 0.145618 0.158895 0.157325 0.157746
qa: -0.0561 -0.0621 -0.2882 -0.4516 -0.3261 0.0896 0.0274 -0.0611 -0.2678 -0.2658 -0.2024 0.3681 0.0397 0.1013 0.0695 -0.2803 -0.2707 0.2975 -0.1193 -0.2164 0.2902 -0.1997 -0.2480 -0.1430 -0.1217 -0.1850 0.0778 0.0961 0.1012 0.0911 0.0976 0.1013 0.0936 0.0966 0.1277 0.1210 0.1158 0.1287 0.1432 0.1585 0.1552 0.1566 0.1456 0.1589 0.1573 0.1577
va: 1.2696 1.2423 2.1173 2.0552 2.0780 3.7363 3.8897 3.7983 3.9054 3.8994 3.8973 4.2294 4.2110 3.7896 3.6111 4.0904 3.9520 3.7207 3.8928 3.9298 3.6845 3.9183 4.0095 3.8890 3.8844 3.9056 1.0495 1.0335 1.0009 1.0056 1.0013 1.0013 1.0024 1.0185 1.0196 0.9913 1.0103 1.0209 1.0129 0.9907 0.9973 0.9969 1.0083 0.9903 0.9894 0.9906
dispcorr: -0.022054929 hartree
energy: -1958.472116062737
dipole: -34.16793 32.04892 -2.11901 26.69408 -26.90550 -0.21142 -8.77358 7.91343 -0.86015
magnitude: 2.29668 au
magnitude: 5.83771 debye
