program: Gaussian 09
title: 000007221
version: EM64L-G09RevD.01
frameworkgroup: C1[X(C8H6S)]
method: RPBEPBE
basis: SDD
operation: Freq
keyword: #p
keyword: freq=noraman
keyword: PBEPBE/SDD
title: #p freq=noraman PBEPBE/SDD
converged: NO YES NO NO
title: Mulliken charges:
elementType: S C C C C C C C C H H H H H H
charge: 0.248987 0.567765 -0.387913 -0.391739 -0.262292 -0.254287 -0.227091 -0.235150 -0.514526 0.240031 0.253065 0.243761 0.227447 0.229291 0.262653
chargesum: 0.00000
title: Mulliken charges with hydrogens summed into heavy atoms:
elementType: S C C C C C C C C
charge: 0.248987 0.567765 -0.387913 -0.151708 -0.009227 -0.010527 0.000355 -0.005859 -0.251873
polarizability: 1.42233313e+02 -1.91638019e+00 1.04793650e+02 1.66469588e-04 -2.44448580e-04 3.76996800e+01
1716.lowfreq: -9.1142 -0.0024 -0.0021 -0.0017 3.7289 5.3773 189.5329 199.5242 329.5955
frequency: 189.5328 199.5240 329.5948 413.8311 463.8391 474.9534 515.1233 565.7058 642.4120 682.0406 705.0116 746.5834 750.6966 782.6055 855.7162 865.0928 897.6393 947.6525 984.6888 1017.5811 1033.2028 1088.2722 1130.8079 1170.9062 1213.7033 1261.2427 1324.3915 1390.1236 1424.9234 1453.0342 1514.7764 1573.0551 1604.4739 3127.8269 3137.9702 3151.0139 3166.6332 3171.9174 3233.7482
redmass: 4.8370 4.2639 5.7558 3.0658 3.9401 7.6081 7.3732 3.1703 7.3620 7.0052 1.6751 1.3336 6.1378 1.8054 4.1669 1.3728 1.3555 1.3977 1.3278 2.5283 3.6270 1.2008 1.4217 1.0875 1.5598 1.5278 2.1310 5.0223 2.6971 2.9063 5.2722 6.4322 6.8186 1.0856 1.0892 1.0953 1.1005 1.0919 1.0999
irintensity: 0.0017 5.4534 3.0021 3.9216 10.6512 0.3639 0.1795 7.4337 4.1473 2.9169 44.7375 33.1496 12.0057 87.7617 5.4531 3.0149 7.1762 5.2246 0.1031 11.5401 10.1749 13.0258 1.5534 1.6237 5.5423 4.0153 2.8833 2.1219 23.1969 12.7718 3.6146 0.2645 0.7611 0.9239 4.4831 24.2319 25.9073 3.4612 1.3851
temp: 298.150 k
press: 1.00000 atm
elementType: 16 6 6 6 6 6 6 6 6 1 1 1 1 1 1
symmnumber: 1
zpe: 294292.4 jmol-1
zpe.correction: 0.112090 hartree
zpe.thermalcorrener: 0.118741 hartree
zpe.thermalcorrenthalpy: 0.119685 hartree
zpe.thermalcorrgfe: 0.080904 hartree
zpe.sumelectzpe: -705.891895 hartree
zpe.sumelectthermal: -705.885244 hartree
zpe.sumelectthermalent: -705.884300 hartree
zpe.sumelectthermalfe: -705.923081 hartree
dipole: 0.4111 0.7955 0.0000
dipole: 0.8955
quadrupole: -51.7728 -52.3080 -65.1917
quadrupole: -2.7920 0.0000 0.0000
quadrupole: 4.6514 4.1161 -8.7675 -2.7920 0.0000 0.0000
hfenergy: -706.0039851 hartree
pointgroup: C01 [X(C8H6S1)]
dipole: 0.1118299 0.3340781 0.0000013 debye
dipolederiv: -0.2487837 0.0526935 -0.0000014 -0.1404072 -0.2518119 0.0000012 -0.0000019 0.0000028 0.0964188 0.1017001 0.0314911 0.0000005 -0.2052319 -0.2043115 -0.0000001 0.0000032 -0.0000007 0.0710389 0.4524425 0.2352331 0.0000011 0.3101801 -0.0447563 0.0000012 0.000001 0.0000018 -0.1333385 -0.0001642 -0.0382289 -0.0000006 0.0044824 0.1157703 0.0000045 0.0000017 0.000009 -0.1711377 -0.098488 -0.2015325 0.000001 -0.0877229 -0.1194491 -0.0000011 -0.0000003 -0.0000019 -0.1714509 -0.129961 -0.0674101 0.0000002 -0.1117756 0.0850048 -0.0000073 0.0000051 -0.0000121 -0.1195616 0.0438649 0.1092535 0.0000008 0.0846189 -0.045666 -0.0000015 0.0000023 -0.000002 -0.1657562 -0.0004768 -0.0411274 -0.0000057 0.0158488 0.0640742 0.0000034 -0.0000165 0.0000066 -0.1768804 -0.184284 -0.0831632 0.0000013 0.0294783 0.4979221 -0.0000032 0.0000008 -0.000004 -0.3036234 0.0707946 0.0236014 0.0000002 -0.0186668 -0.1042465 -0.0000025 -0.0000016 -0.0000048 0.1648913 0.0882561 -0.0131888 -0.0000004 0.0710783 -0.0630619 0.0000015 -0.0000009 0.0000013 0.1942732 0.0885221 -0.0263556 0.0000003 0.024806 -0.0742384 0.0000044 -0.0000009 0.0000062 0.1670561 -0.0855798 -0.0958556 0.0000005 -0.0992431 0.0346175 -0.0000001 0.0000005 -0.0000006 0.1637841 -0.0865644 0.0887288 0.0000033 0.0853304 0.0383136 -0.0000011 0.0000081 -0.0000025 0.1662406 -0.0112785 0.0258607 -0.0000011 0.0372244 0.0718393 0.0000007 -0.0000007 0.0000009 0.2180457 unknown
polarizability: 141.9333071|3.8489764|105.0936554|0.000202|-0.000216|37.69968 unknown
InChI: InChI=1S/C8H6S/c1-2-4-8-7(3-1)5-6-9-8/h1-6H
charge 0 multiplicity 1
15 atoms
S  -1.871862 -1.44328 -0.000006
C  -0.23902 0.69567 -0.000009
C  -0.196841 -0.737831 -0.000003
C  0.988481 1.413696 -0.000005
C  -1.597072 1.211966 -0.000016
C  1.01898 -1.450703 0.000004
C  2.206131 0.709387 -0.000007
C  2.222999 -0.714172 -0.000003
C  -2.560927 0.228694 -0.000016
H  0.977043 2.509635 0.000008
H  -1.833833 2.279116 -0.000022
H  1.035313 -2.545537 0.000025
H  3.154183 1.25838 -0.000009
H  3.180853 -1.2457 -0.00002
H  -3.64393 0.342778 -0.000021
