program: Gaussian 09
title: 000071954
version: EM64L-G09RevD.01
frameworkgroup: C1[X(C19H26NO)]
method: RPBEPBE
basis: SDD
operation: Freq
keyword: #p
keyword: freq=noraman
keyword: PBEPBE/SDD
title: #p freq=noraman PBEPBE/SDD
converged: YES YES NO NO
title: Mulliken charges:
elementType: O N C C C C C C C C C C C C C C C C C C C H H H H H H H H H H H H H H H H H H H H H H H H H H
charge: -0.276195 -0.111580 -0.367721 -0.258787 -0.553452 -0.536836 -0.545035 -0.197483 -0.639460 0.483847 0.521280 -0.371235 -0.455249 -0.407833 -0.409849 -0.237108 -0.215805 -0.233997 -0.235872 -0.231374 -0.240089 0.279663 0.285386 0.213634 0.222453 0.274690 0.260607 0.275172 0.271005 0.262929 0.271652 0.271215 0.271214 0.261187 0.229288 0.236252 0.247535 0.249431 0.240581 0.230542 0.233663 0.239428 0.241899 0.245955 0.230855 0.234927 0.238667
chargesum: 1.00000
title: Mulliken charges with hydrogens summed into heavy atoms:
elementType: O N C C C C C C C C C C C C C C C C C C C
charge: -0.276195 -0.111580 0.197328 0.177300 0.257018 0.268749 0.258582 0.031805 -0.155673 0.483847 0.521280 -0.121804 -0.214667 -0.177291 -0.176186 0.002321 0.026094 0.011958 -0.005017 0.003552 -0.001421
polarizability: 2.17807821e+02 4.74828607e+01 2.14494813e+02 -1.57776611e+01 1.42748463e+01 1.85099484e+02
1716.lowfreq: -16.1437 -12.3673 -4.0750 -0.4588 -0.0005 -0.0004 0.0002 14.4152 19.9179
frequency: -12.1206 11.7603 18.3932 31.2528 34.4921 51.4305 62.9235 86.2460 100.9537 131.4421 178.4929 183.5491 206.0515 217.2202 237.0157 249.3915 264.6798 293.3883 335.3406 339.7455 347.3478 402.0758 403.2403 404.2931 431.0317 446.0945 475.6362 489.9397 516.8989 554.2701 572.4151 615.9190 616.8731 632.6240 704.1638 709.0328 727.7154 753.0610 771.5221 793.9123 814.1148 817.8356 854.5163 860.5353 861.8546 886.7547 918.9121 926.7725 929.3801 941.5299 965.9637 977.5916 984.2436 989.5343 989.9810 999.4386 1006.0532 1019.2167 1025.8873 1028.2722 1041.1942 1045.9372 1057.7984 1068.4713 1078.2705 1092.6858 1120.4656 1137.2458 1174.4415 1177.2780 1181.4539 1184.2982 1186.9768 1188.9072 1212.6494 1217.8798 1220.6172 1248.8281 1253.8747 1263.2425 1303.2730 1304.4063 1319.4547 1329.1514 1343.7503 1345.0339 1381.8066 1385.7365 1394.9978 1423.6173 1424.3066 1440.3917 1442.9976 1448.6022 1453.0449 1458.8879 1461.1153 1463.6099 1471.6946 1481.9827 1483.6734 1485.0233 1486.5193 1493.4749 1501.2935 1593.1387 1593.4786 1610.7067 1613.3636 2936.7580 2954.9854 2987.7220 3004.1992 3025.6644 3027.6650 3030.7617 3037.2209 3063.2237 3111.6229 3112.7929 3116.3697 3121.6693 3126.7184 3136.8981 3141.1593 3142.2317 3142.3720 3147.3031 3147.4380 3148.1782 3152.9708 3153.4989 3156.8791 3166.0299 3170.7096
redmass: 2.6713 3.6802 4.4467 4.1928 3.7211 4.4179 2.4085 1.9359 3.4511 4.3592 3.3015 1.4633 3.7317 3.7589 4.4784 1.0807 1.1068 3.3587 2.9094 2.2413 2.1959 3.0208 2.8447 2.8160 2.2794 3.2968 3.0396 3.5173 3.7990 2.9110 4.0955 6.3694 6.3255 5.4024 1.8927 1.7696 3.6632 1.8193 2.2345 3.1638 1.4410 2.3507 1.2557 1.2958 2.7235 3.2399 1.5461 2.5725 1.4211 2.6583 2.4682 1.3999 1.3977 5.9103 5.5159 1.3612 1.3364 3.8616 2.2093 3.0772 3.1243 1.1970 1.2882 1.9531 1.6235 1.5848 1.6878 1.4209 1.0575 1.0751 1.2257 1.2907 1.1182 1.1667 2.2270 2.0425 2.0193 1.4506 1.8895 1.4119 1.2691 1.3019 1.3704 1.2664 1.3072 1.3891 7.6353 5.1919 1.3934 1.1456 1.1551 2.1387 2.1012 1.0922 1.0463 1.1142 1.1056 1.0411 1.0734 2.2531 2.3228 1.0553 1.0571 1.0707 1.0692 6.0041 6.0224 6.0426 6.1758 1.0548 1.0844 1.1062 1.0605 1.0321 1.0323 1.0348 1.0573 1.1018 1.0888 1.1083 1.0891 1.0865 1.0871 1.0906 1.1058 1.0905 1.1057 1.1049 1.0958 1.1053 1.0956 1.1054 1.1048 1.1014 1.1013
irintensity: 0.0630 0.0752 3.0859 1.0418 0.2334 0.6875 0.3622 0.3542 0.6871 3.5208 4.5910 2.2318 6.9709 4.9132 0.9331 0.4214 0.3109 1.0694 0.8709 0.1312 0.4280 1.1091 0.2373 0.2982 0.0390 0.2418 5.4147 3.2079 5.5299 26.0938 19.8345 0.4739 0.0826 7.8752 44.6593 53.9834 14.2634 17.9181 65.9652 8.7646 6.0179 6.6666 0.0309 0.2870 5.5354 77.4753 4.7579 13.2834 6.3413 18.2630 27.9563 0.2945 0.3010 2.4582 0.2972 0.1546 0.2021 55.2394 9.3737 58.0983 27.2093 0.0445 1.4066 4.7522 16.1551 3.1063 1.7847 0.1671 0.0169 0.3180 1.0040 1.5946 0.2284 0.3156 1.8279 8.9328 8.2008 4.9358 0.3747 2.5797 10.7687 3.3400 4.2869 1.1318 6.8632 3.9179 0.0092 1.1853 5.2800 20.2153 11.7269 7.5839 12.4277 2.1757 0.4424 10.6299 4.3948 0.3259 4.6677 3.2736 22.1517 43.0974 57.1114 38.1127 51.3041 0.8876 2.7066 0.2001 6.4008 55.4458 28.5328 31.1410 20.8160 2.6227 3.9575 3.5054 4.0666 8.2128 11.3762 3.3085 8.0306 6.7960 4.6892 7.0419 0.6852 2.8238 0.2314 1.4385 34.3959 10.9318 23.2409 1.8238 6.4981 18.9759 15.9653
temp: 298.150 k
press: 1.00000 atm
elementType: 8 7 6 6 6 6 6 6 6 6 6 6 6 6 6 6 6 6 6 6 6 1 1 1 1 1 1 1 1 1 1 1 1 1 1 1 1 1 1 1 1 1 1 1 1 1 1
symmnumber: 1
zpe: 1069188.2 jmol-1
zpe.correction: 0.407232 hartree
zpe.thermalcorrener: 0.427811 hartree
zpe.thermalcorrenthalpy: 0.428755 hartree
zpe.thermalcorrgfe: 0.354569 hartree
zpe.sumelectzpe: -867.757190 hartree
zpe.sumelectthermal: -867.736611 hartree
zpe.sumelectthermalent: -867.735667 hartree
zpe.sumelectthermalfe: -867.809853 hartree
dipole: 10.8323 -11.4307 1.5263
dipole: 15.8218
quadrupole: -85.1208 -64.5559 -109.9028
quadrupole: -23.7673 -2.9103 1.7863
quadrupole: 1.4057 21.9706 -23.3763 -23.7673 -2.9103 1.7863
hfenergy: -868.164422 hartree
pointgroup: C01 [X(C19H26N1O1)]
dipole: -4.6359602 4.0233284 1.0337365 debye
polarizability: 210.5137673|45.4311123|224.8667288|17.30043|-13.8780764|182.0216224 unknown
InChI: InChI=1S/C19H26NO/c1-20(2,3)14-15-21-19(18-12-8-5-9-13-18)16-17-10-6-4-7-11-17/h4-13,19H,14-16H2,1-3H3
charge 1 multiplicity 1
47 atoms
O  -0.217559 0.258851 -0.346928
N  -2.797821 2.906383 0.375906
C  -1.549425 2.148338 -0.134055
C  -1.342477 0.737156 0.441949
C  -2.774953 3.018715 1.899389
C  -2.770705 4.312629 -0.227409
C  -4.080369 2.203547 -0.069167
C  0.367055 -1.02449 0.159753
C  1.653231 -1.238966 -0.673633
C  -0.639937 -2.160768 0.048731
C  2.697369 -0.154662 -0.449989
C  -1.283348 -2.434215 -1.186954
C  -0.935888 -2.968967 1.174061
C  2.838273 0.921724 -1.361626
C  3.547429 -0.198419 0.685445
C  -2.201576 -3.500712 -1.293567
C  -1.849635 -4.043026 1.067006
C  -2.485404 -4.309993 -0.166836
C  3.802601 1.932282 -1.144832
C  4.510223 0.811701 0.909082
C  4.640123 1.88215 -0.006263
H  -1.642874 2.074426 -1.231088
H  -0.671517 2.773332 0.10124
H  -1.080772 0.763116 1.521883
H  -2.22767 0.079879 0.306423
H  -1.818608 3.465977 2.210372
H  -3.611305 3.657676 2.222284
H  -2.8816 2.018349 2.341884
H  -2.758327 4.230774 -1.324741
H  -3.666608 4.863407 0.097824
H  -1.86471 4.833878 0.116737
H  -4.071094 2.105177 -1.165229
H  -4.134432 1.207748 0.392273
H  -4.945154 2.807244 0.246553
H  0.646524 -0.873487 1.225617
H  1.369617 -1.2984 -1.740499
H  2.05497 -2.230618 -0.393044
H  -1.061439 -1.810855 -2.061306
H  -0.440281 -2.77048 2.133217
H  2.197239 0.960302 -2.250562
H  3.473865 -1.039081 1.387888
H  -2.687118 -3.71142 -2.252767
H  -2.06197 -4.66993 1.939622
H  -3.189777 -5.144242 -0.252624
H  3.912402 2.748203 -1.868264
H  5.168187 0.755866 1.783347
H  5.396146 2.6579 0.157295
