program: Orca
programVersion: 5.0.3
elementType: Cl Cl O O O C C C C C C C C C C C C C C C C C C C C C H H H H H H H H H H H H H H H H H H H H
charge: 0
multiplicity: 1
keywords: wb97x-d3
keywords: def2-TZVPP
keywords: def2/J RIJCOSX
keywords: DEFGRID2
keywords: scfconv7
keywords: smallprint printgap noloewdin
keywords: NOSOSCF
formula: C21H20Cl2O3
InChI: InChI=1/C21H20Cl2O3/c1-21(2)17(12-18(22)23)19(21)20(24)25-13-14-7-6-10-16(11-14)26-15-8-4-3-5-9-15/h3-12,17,19H,13H2,1-2H3
46 atoms
Cl 1.763842 -3.296278 -2.723979
Cl 4.574019 -3.834948 -2.321432
O  -0.629476 -0.156587 -1.546037
O  -1.17469 -1.825096 -0.165265
O  -2.934541 3.427438 1.396118
C  1.647342 -1.179684 1.093059
C  1.725082 -2.365141 0.195278
C  1.098997 -1.089849 -0.324203
C  2.898486 -0.373525 1.344389
C  0.718049 -1.225078 2.279827
C  2.99873 -2.835458 -0.391866
C  -0.34298 -1.086256 -0.635082
C  3.099918 -3.265618 -1.64127
C  -1.992702 -0.038944 -1.959163
C  -2.865792 0.56513 -0.89615
C  -2.454845 1.716201 -0.232111
C  -4.098797 -0.001636 -0.597463
C  -3.272936 2.277763 0.738404
C  -4.919713 0.585366 0.354601
C  -4.509427 1.72042 1.03589
C  -1.644586 3.63616 1.800029
C  -0.857551 2.620178 2.330538
C  -1.159944 4.934126 1.715111
C  0.426767 2.915267 2.7641
C  0.122657 5.215999 2.163241
C  0.924581 4.209012 2.682507
H  1.012178 -3.157376 0.410553
H  1.70477 -0.500814 -1.003641
H  3.478794 -0.809762 2.159117
H  3.545161 -0.314943 0.468964
H  2.643675 0.648003 1.632237
H  0.339414 -0.228809 2.516103
H  -0.135143 -1.882852 2.133465
H  1.261437 -1.584419 3.155805
H  3.888697 -2.856733 0.227011
H  -1.955072 0.606866 -2.836259
H  -2.382752 -1.007234 -2.278067
H  -1.501634 2.172357 -0.472892
H  -4.417423 -0.902389 -1.107385
H  -5.88102 0.144478 0.584861
H  -5.13982 2.172765 1.791165
H  -1.235821 1.608502 2.410889
H  -1.785923 5.717324 1.305582
H  1.039326 2.123468 3.176564
H  0.496186 6.229855 2.097163
H  1.927002 4.430403 3.024484
elementType: Cl O C H
totalener: -1958.44725633 hartree
nucrepener: 2560.09180927 hartree
electener: -4518.53906560 hartree
oneelecener: -7773.92545273 hartree
twoeener: 3255.38638713 hartree
cpcmener: -0.02558331 hartree
kineticenergy: 1952.58034788 hartree
xcener: -143.509414676282 hartree
chargesum: -0.0000000
charge: -0.051443 -0.056446 -0.287553 -0.460438 -0.331615 0.144179 -0.041381 -0.130649 -0.281562 -0.267780 -0.218404 0.399319 0.075479 0.103169 0.036664 -0.237579 -0.218948 0.270435 -0.113365 -0.251443 0.283919 -0.186016 -0.253162 -0.141911 -0.114996 -0.201345 0.111440 0.109188 0.102169 0.094124 0.093504 0.078993 0.098167 0.101362 0.139751 0.123087 0.113743 0.139731 0.141621 0.157536 0.146368 0.160664 0.145018 0.162498 0.157300 0.156606
qa: -0.0514 -0.0564 -0.2876 -0.4604 -0.3316 0.1442 -0.0414 -0.1306 -0.2816 -0.2678 -0.2184 0.3993 0.0755 0.1032 0.0367 -0.2376 -0.2189 0.2704 -0.1134 -0.2514 0.2839 -0.1860 -0.2532 -0.1419 -0.1150 -0.2013 0.1114 0.1092 0.1022 0.0941 0.0935 0.0790 0.0982 0.1014 0.1398 0.1231 0.1137 0.1397 0.1416 0.1575 0.1464 0.1607 0.1450 0.1625 0.1573 0.1566
va: 1.2802 1.2501 2.1128 2.0465 2.0775 3.6894 3.8814 3.8212 3.9202 3.8868 3.9057 4.1467 4.1821 3.7983 3.6185 3.9315 3.9629 3.7222 3.8949 4.0158 3.7317 3.8884 4.0102 3.8720 3.8862 3.9428 1.0251 1.0256 0.9992 1.0003 1.0068 1.0062 1.0212 1.0026 1.0086 0.9920 1.0097 1.0173 1.0042 0.9890 1.0063 0.9927 1.0083 0.9864 0.9885 0.9923
dispcorr: -0.025132872 hartree
energy: -1958.472389198828
dipole: -11.32328 12.14238 0.81910 21.98187 -21.35229 0.62957 24.89713 -24.45144 0.44568
magnitude: 1.12513 au
magnitude: 2.85985 debye
