program: Orca
programVersion: 5.0.3
elementType: Cl Cl O O O C C C C C C C C C C C C C C C C C C C C C H H H H H H H H H H H H H H H H H H H H
charge: 0
multiplicity: 1
keywords: wb97x-d3
keywords: def2-TZVPP
keywords: def2/J RIJCOSX
keywords: DEFGRID2
keywords: scfconv7
keywords: smallprint printgap noloewdin
keywords: NOSOSCF
formula: C21H20Cl2O3
InChI: InChI=1/C21H20Cl2O3/c1-21(2)17(12-18(22)23)19(21)20(24)25-13-14-7-6-10-16(11-14)26-15-8-4-3-5-9-15/h3-12,17,19H,13H2,1-2H3
46 atoms
Cl 3.424641 -4.39365 0.152028
Cl 5.178043 -3.393334 -1.909709
O  -1.410803 -0.597457 -1.661144
O  -1.098021 -2.021096 0.040781
O  -3.009399 2.821995 1.74842
C  1.569314 -0.305233 0.215185
C  1.845201 -1.696179 -0.284129
C  0.760645 -0.867024 -0.937538
C  2.509956 0.823682 -0.128081
C  0.961521 -0.165618 1.588398
C  3.047062 -2.013367 -1.064046
C  -0.656788 -1.249323 -0.774074
C  3.770395 -3.120199 -0.953865
C  -2.821494 -0.775716 -1.648245
C  -3.529794 0.288544 -0.852548
C  -2.875396 1.078899 0.082407
C  -4.894671 0.464016 -1.06772
C  -3.586727 2.047654 0.782935
C  -5.593303 1.42313 -0.353912
C  -4.944174 2.229656 0.569204
C  -1.708797 3.231958 1.648387
C  -0.969681 3.25996 2.823305
C  -1.15255 3.670366 0.45182
C  0.3356 3.730008 2.799903
C  0.158105 4.125454 0.44145
C  0.908218 4.157422 1.610036
H  1.484556 -2.485947 0.36528
H  0.998887 -0.437081 -1.904146
H  3.3760 0.819381 0.537245
H  2.87492 0.783435 -1.153712
H  2.002253 1.782307 -0.003634
H  0.338342 -1.011039 1.873103
H  1.757377 -0.083119 2.331854
H  0.356637 0.742197 1.656897
H  3.377859 -1.291038 -1.800683
H  -3.133242 -0.720865 -2.692386
H  -3.088577 -1.769774 -1.281748
H  -1.817101 0.958523 0.274305
H  -5.409414 -0.147365 -1.799361
H  -6.652957 1.558739 -0.527428
H  -5.484325 2.989229 1.119935
H  -1.417513 2.921116 3.749111
H  -1.728612 3.665107 -0.465022
H  0.907794 3.752592 3.718334
H  0.591898 4.463827 -0.491024
H  1.929263 4.515038 1.592572
elementType: Cl O C H
totalener: -1958.44958179 hartree
nucrepener: 2539.40355160 hartree
electener: -4497.85313339 hartree
oneelecener: -7732.09040023 hartree
twoeener: 3234.23726683 hartree
cpcmener: -0.02541081 hartree
kineticenergy: 1952.55042719 hartree
xcener: -143.508540320085 hartree
chargesum: -0.0000000
charge: -0.055904 -0.061705 -0.282073 -0.449711 -0.325088 0.109119 0.025013 -0.073325 -0.272605 -0.236983 -0.201985 0.366068 0.037855 0.081402 0.030482 -0.203126 -0.241982 0.297406 -0.106727 -0.259050 0.289326 -0.225970 -0.198120 -0.125056 -0.142762 -0.193697 0.077741 0.095340 0.103779 0.094702 0.087134 0.101673 0.107164 0.041678 0.127086 0.124525 0.115761 0.130169 0.140290 0.156177 0.144301 0.143220 0.154709 0.156216 0.159766 0.157769
qa: -0.0559 -0.0617 -0.2821 -0.4497 -0.3251 0.1091 0.0250 -0.0733 -0.2726 -0.2370 -0.2020 0.3661 0.0379 0.0814 0.0305 -0.2031 -0.2420 0.2974 -0.1067 -0.2590 0.2893 -0.2260 -0.1981 -0.1251 -0.1428 -0.1937 0.0777 0.0953 0.1038 0.0947 0.0871 0.1017 0.1072 0.0417 0.1271 0.1245 0.1158 0.1302 0.1403 0.1562 0.1443 0.1432 0.1547 0.1562 0.1598 0.1578
va: 1.2700 1.2431 2.1247 2.0546 2.0886 3.6952 3.8878 3.8229 3.9054 3.8876 3.9023 4.2379 4.2120 3.8375 3.6772 3.9380 3.9734 3.7227 3.8894 4.0030 3.6785 3.9533 3.8892 3.8535 3.8330 3.8575 1.0522 1.0339 1.0010 1.0083 1.0117 1.0232 1.0022 1.0227 1.0204 0.9925 1.0123 0.9885 1.0018 0.9893 1.0087 1.0090 0.9962 0.9898 0.9903 0.9912
dispcorr: -0.025403991 hartree
energy: -1958.474985782609
dipole: -20.04267 19.94756 -0.09511 30.46479 -28.94172 1.52307 6.96749 -7.94205 -0.97457
magnitude: 1.81068 au
magnitude: 4.60239 debye
