program: Orca
programVersion: 5.0.3
elementType: Cl Cl O O O C C C C C C C C C C C C C C C C C C C C C H H H H H H H H H H H H H H H H H H H H
charge: 0
multiplicity: 1
keywords: wb97x-d3
keywords: def2-TZVPP
keywords: def2/J RIJCOSX
keywords: DEFGRID2
keywords: scfconv7
keywords: smallprint printgap noloewdin
keywords: NOSOSCF
formula: C21H20Cl2O3
InChI: InChI=1/C21H20Cl2O3/c1-21(2)17(12-18(22)23)19(21)20(24)25-13-14-7-6-10-16(11-14)26-15-8-4-3-5-9-15/h3-12,17,19H,13H2,1-2H3
46 atoms
Cl 2.555516 -5.759956 -0.809457
Cl 4.596804 -4.923537 -2.668682
O  -0.849611 -0.419911 -1.776023
O  -1.060434 -2.066077 -0.277361
O  -2.326475 4.203983 0.287927
C  1.987505 -1.441109 0.162202
C  1.835976 -2.690051 -0.659764
C  1.106374 -1.425852 -1.070304
C  3.256748 -0.628459 0.07444
C  1.386411 -1.438879 1.546102
C  2.921775 -3.181738 -1.51632
C  -0.366826 -1.366114 -0.974805
C  3.30079 -4.447751 -1.636671
C  -2.263069 -0.171785 -1.760248
C  -2.648526 0.706199 -0.604524
C  -2.284022 2.048779 -0.62245
C  -3.352916 0.202907 0.482916
C  -2.641035 2.882713 0.425991
C  -3.701128 1.044841 1.5303
C  -3.35383 2.386789 1.512283
C  -1.968471 4.967228 1.364101
C  -2.422088 6.279265 1.377182
C  -1.131905 4.496801 2.369199
C  -2.028402 7.129407 2.399951
C  -0.755298 5.356292 3.391776
C  -1.197219 6.672202 3.413361
H  1.209628 -3.451154 -0.207926
H  1.521418 -0.889253 -1.916093
H  3.650625 -0.555173 -0.938725
H  3.073346 0.389332 0.423694
H  4.035191 -1.060375 0.706344
H  2.13878 -1.763081 2.267648
H  1.070029 -0.432865 1.829675
H  0.531056 -2.102392 1.64804
H  3.470548 -2.455435 -2.103971
H  -2.460651 0.331264 -2.706266
H  -2.822121 -1.108282 -1.754571
H  -1.73867 2.458807 -1.465187
H  -3.640348 -0.840311 0.508609
H  -4.258774 0.654845 2.372072
H  -3.648917 3.033169 2.329171
H  -3.071029 6.632056 0.585224
H  -0.766811 3.47741 2.357272
H  -2.379366 8.153388 2.403469
H  -0.101943 4.991472 4.174052
H  -0.893434 7.33653 4.211649
elementType: Cl O C H
totalener: -1958.45014610 hartree
nucrepener: 2410.29672414 hartree
electener: -4368.74687024 hartree
oneelecener: -7474.26362858 hartree
twoeener: 3105.51675834 hartree
cpcmener: -0.02480323 hartree
kineticenergy: 1952.56366180 hartree
xcener: -143.505238642249 hartree
chargesum: -0.0000000
charge: -0.055972 -0.061501 -0.283230 -0.464959 -0.327217 0.088799 0.030237 -0.087854 -0.263857 -0.270037 -0.199640 0.404855 0.036939 0.087142 -0.006816 -0.265606 -0.170597 0.274090 -0.149501 -0.192027 0.292044 -0.252953 -0.201463 -0.120381 -0.145411 -0.185837 0.079213 0.094956 0.090117 0.098532 0.100656 0.097351 0.099845 0.094766 0.128937 0.124850 0.114999 0.131153 0.140796 0.158601 0.156695 0.144718 0.160532 0.157388 0.158896 0.157753
qa: -0.0560 -0.0615 -0.2832 -0.4650 -0.3272 0.0888 0.0302 -0.0879 -0.2639 -0.2700 -0.1996 0.4049 0.0369 0.0871 -0.0068 -0.2656 -0.1706 0.2741 -0.1495 -0.1920 0.2920 -0.2530 -0.2015 -0.1204 -0.1454 -0.1858 0.0792 0.0950 0.0901 0.0985 0.1007 0.0974 0.0998 0.0948 0.1289 0.1249 0.1150 0.1312 0.1408 0.1586 0.1567 0.1447 0.1605 0.1574 0.1589 0.1578
va: 1.2699 1.2433 2.1293 2.0454 2.0751 3.7281 3.8670 3.8452 3.9063 3.9042 3.8912 4.1914 4.2110 3.8004 3.6491 4.0669 3.9198 3.7435 3.9270 3.9175 3.6868 4.0093 3.9113 3.8835 3.8948 3.9062 1.0482 1.0340 1.0057 1.0016 1.0013 1.0004 0.9992 1.0204 1.0184 0.9949 1.0091 1.0222 1.0136 0.9912 0.9960 1.0089 0.9962 0.9892 0.9905 0.9905
dispcorr: -0.021442316 hartree
energy: -1958.471588416164
dipole: -14.78757 14.88858 0.10101 35.73102 -34.15013 1.58089 18.54409 -18.20497 0.33912
magnitude: 1.62000 au
magnitude: 4.11772 debye
