program: Orca
programVersion: 5.0.3
elementType: Cl Cl O O O C C C C C C C C C C C C C C C C C C C C C H H H H H H H H H H H H H H H H H H H H
charge: 0
multiplicity: 1
keywords: wb97x-d3
keywords: def2-TZVPP
keywords: def2/J RIJCOSX
keywords: DEFGRID2
keywords: scfconv7
keywords: smallprint printgap noloewdin
keywords: NOSOSCF
formula: C21H20Cl2O3
InChI: InChI=1/C21H20Cl2O3/c1-21(2)17(12-18(22)23)19(21)20(24)25-13-14-7-6-10-16(11-14)26-15-8-4-3-5-9-15/h3-12,17,19H,13H2,1-2H3
46 atoms
Cl 3.75853 -0.266906 1.000989
Cl 5.306859 -2.677763 0.647788
O  -1.13051 -1.547935 1.152084
O  -2.078696 -3.325121 0.178639
O  -2.846427 3.302307 -0.46493
C  0.623845 -2.073892 -1.488347
C  1.378544 -1.951402 -0.186823
C  0.189331 -2.874838 -0.281025
C  1.219611 -2.846625 -2.639012
C  -0.191678 -0.882226 -1.9275
C  2.715154 -2.536962 -0.018392
C  -1.119397 -2.614928 0.366145
C  3.773405 -1.908702 0.478391
C  -2.387951 -1.089442 1.679835
C  -3.053179 -0.180307 0.687662
C  -2.633167 1.144491 0.603955
C  -4.033007 -0.651782 -0.180037
C  -3.176986 1.982188 -0.360149
C  -4.57915 0.199398 -1.130482
C  -4.147836 1.512037 -1.234984
C  -1.576248 3.735287 -0.200313
C  -0.449576 3.04933 -0.639086
C  -1.451106 4.940701 0.475391
C  0.80782 3.575452 -0.379665
C  -0.187573 5.462804 0.713792
C  0.946815 4.780404 0.29626
H  1.214289 -1.017762 0.338659
H  0.404515 -3.93622 -0.350141
H  1.935374 -2.230356 -3.187041
H  1.732601 -3.754345 -2.322584
H  0.435045 -3.143511 -3.337672
H  0.399202 -0.256441 -2.599506
H  -1.084156 -1.198885 -2.472047
H  -0.511873 -0.254178 -1.096887
H  2.859466 -3.568624 -0.318505
H  -3.025154 -1.929725 1.954874
H  -2.125562 -0.549434 2.588559
H  -1.885394 1.511514 1.297471
H  -4.372682 -1.676996 -0.114782
H  -5.341559 -0.164192 -1.80698
H  -4.56815 2.173643 -1.982065
H  -0.541616 2.117474 -1.182869
H  -2.33677 5.469237 0.805579
H  1.684868 3.036738 -0.716109
H  -0.093976 6.40503 1.238028
H  1.930914 5.185829 0.491711
elementType: Cl O C H
totalener: -1958.44720940 hartree
nucrepener: 2557.86732509 hartree
electener: -4516.31453449 hartree
oneelecener: -7768.76126347 hartree
twoeener: 3252.44672898 hartree
cpcmener: -0.02554602 hartree
kineticenergy: 1952.55255823 hartree
xcener: -143.503793471220 hartree
chargesum: -0.0000000
charge: -0.059350 -0.061108 -0.266616 -0.457585 -0.328129 0.091823 0.066871 -0.101217 -0.267276 -0.242003 -0.225857 0.391927 0.043085 0.043216 -0.010731 -0.221337 -0.178656 0.296169 -0.130245 -0.238077 0.274617 -0.183021 -0.237088 -0.167415 -0.128037 -0.174523 0.078995 0.101551 0.099129 0.089627 0.099129 0.102506 0.106102 0.048657 0.131612 0.118408 0.121947 0.140616 0.143152 0.157163 0.146554 0.171603 0.145397 0.153058 0.157590 0.157764
qa: -0.0593 -0.0611 -0.2666 -0.4576 -0.3281 0.0918 0.0669 -0.1012 -0.2673 -0.2420 -0.2259 0.3919 0.0431 0.0432 -0.0107 -0.2213 -0.1787 0.2962 -0.1302 -0.2381 0.2746 -0.1830 -0.2371 -0.1674 -0.1280 -0.1745 0.0790 0.1016 0.0991 0.0896 0.0991 0.1025 0.1061 0.0487 0.1316 0.1184 0.1219 0.1406 0.1432 0.1572 0.1466 0.1716 0.1454 0.1531 0.1576 0.1578
va: 1.2672 1.2440 2.1318 2.0427 2.0840 3.7551 3.8025 3.8499 3.9000 3.9121 3.8848 4.2311 4.2033 3.8365 3.6245 3.9076 3.9175 3.6968 3.9312 4.0023 3.7176 3.8835 3.9943 3.9187 3.8874 3.9005 1.0409 1.0289 1.0016 1.0051 1.0013 1.0023 1.0034 1.0140 1.0165 1.0108 0.9985 1.0086 1.0158 0.9895 1.0063 0.9867 1.0081 0.9958 0.9892 0.9901
dispcorr: -0.025101523 hartree
energy: -1958.472310918363
dipole: -24.84710 24.92119 0.07409 5.92507 -5.60342 0.32166 -13.97684 13.66204 -0.31480
magnitude: 0.45613 au
magnitude: 1.15938 debye
