program: Orca
programVersion: 5.0.3
elementType: Cl Cl O O O C C C C C C C C C C C C C C C C C C C C C H H H H H H H H H H H H H H H H H H H H
charge: 0
multiplicity: 1
keywords: wb97x-d3
keywords: def2-TZVPP
keywords: def2/J RIJCOSX
keywords: DEFGRID2
keywords: scfconv7
keywords: smallprint printgap noloewdin
keywords: NOSOSCF
formula: C21H20Cl2O3
InChI: InChI=1/C21H20Cl2O3/c1-21(2)17(12-18(22)23)19(21)20(24)25-13-14-7-6-10-16(11-14)26-15-8-4-3-5-9-15/h3-12,17,19H,13H2,1-2H3
46 atoms
Cl 3.272478 -4.400502 0.552771
Cl 5.128622 -3.610516 -1.511558
O  -1.395013 -0.606875 -1.727597
O  -1.192923 -1.919255 0.073191
O  -2.911621 2.981229 1.548073
C  1.5227 -0.305053 0.248496
C  1.770337 -1.728485 -0.16686
C  0.74283 -0.900157 -0.907274
C  2.514306 0.77424 -0.112099
C  0.858695 -0.074235 1.583091
C  2.995291 -2.125178 -0.870881
C  -0.692336 -1.221602 -0.773486
C  3.698002 -3.2254 -0.631589
C  -2.808989 -0.746415 -1.72353
C  -3.502027 0.205256 -0.783839
C  -2.813048 1.167814 -0.056661
C  -4.888059 0.122027 -0.682327
C  -3.517111 2.044005 0.76417
C  -5.576401 1.002613 0.136369
C  -4.899902 1.971581 0.860971
C  -1.646374 3.430145 1.278545
C  -1.301157 3.939546 0.032153
C  -0.730951 3.424447 2.321277
C  -0.020802 4.435509 -0.164794
C  0.542688 3.936841 2.114871
C  0.905152 4.43662 0.871586
H  1.355173 -2.470457 0.506069
H  1.031004 -0.530333 -1.885137
H  2.929762 0.661325 -1.113034
H  2.031531 1.753115 -0.071026
H  3.345249 0.785129 0.596583
H  1.623538 0.074476 2.348255
H  0.240371 0.825968 1.560108
H  0.235396 -0.90547 1.905348
H  3.365097 -1.474168 -1.654636
H  -3.115711 -0.534963 -2.748767
H  -3.099608 -1.776835 -1.506628
H  -1.735722 1.245633 -0.125579
H  -5.428988 -0.628521 -1.24651
H  -6.654649 0.939529 0.210679
H  -5.435856 2.661121 1.501146
H  -2.021071 3.954644 -0.777313
H  -1.015394 3.026002 3.28776
H  0.250517 4.830021 -1.136056
H  1.255658 3.933664 2.930064
H  1.900958 4.828356 0.710939
elementType: Cl O C H
totalener: -1958.44958000 hartree
nucrepener: 2545.64179866 hartree
electener: -4504.09137866 hartree
oneelecener: -7744.71021742 hartree
twoeener: 3240.61883877 hartree
cpcmener: -0.02598739 hartree
kineticenergy: 1952.54171094 hartree
xcener: -143.507150819548 hartree
chargesum: -0.0000000
charge: -0.056281 -0.061136 -0.289534 -0.449370 -0.324792 0.118886 0.019793 -0.063962 -0.272025 -0.251388 -0.203411 0.361605 0.038735 0.081454 0.024445 -0.233997 -0.267136 0.348154 -0.095770 -0.274412 0.293123 -0.207591 -0.236780 -0.119754 -0.124168 -0.197220 0.078703 0.095152 0.093886 0.086935 0.102244 0.103761 0.057972 0.103162 0.129417 0.130959 0.117754 0.126277 0.140576 0.155986 0.143447 0.155925 0.145228 0.159408 0.157242 0.158498
qa: -0.0563 -0.0611 -0.2895 -0.4494 -0.3248 0.1189 0.0198 -0.0640 -0.2720 -0.2514 -0.2034 0.3616 0.0387 0.0815 0.0244 -0.2340 -0.2671 0.3482 -0.0958 -0.2744 0.2931 -0.2076 -0.2368 -0.1198 -0.1242 -0.1972 0.0787 0.0952 0.0939 0.0869 0.1022 0.1038 0.0580 0.1032 0.1294 0.1310 0.1178 0.1263 0.1406 0.1560 0.1434 0.1559 0.1452 0.1594 0.1572 0.1585
va: 1.2696 1.2437 2.1212 2.0533 2.0907 3.6744 3.8965 3.8244 3.9114 3.8818 3.9020 4.2196 4.2108 3.8179 3.6889 3.9156 3.9984 3.6660 3.8790 4.0059 3.6498 3.9241 3.9542 3.8412 3.8275 3.8673 1.0515 1.0340 1.0077 1.0061 1.0012 1.0025 1.0173 1.0238 1.0188 0.9900 1.0125 1.0143 1.0010 0.9888 1.0095 0.9963 1.0087 0.9891 0.9895 0.9914
dispcorr: -0.025486693 hartree
energy: -1958.475066693089
dipole: -19.68506 19.73136 0.04630 30.99175 -29.48976 1.50200 4.05592 -5.15389 -1.09797
magnitude: 1.86109 au
magnitude: 4.73052 debye
