program: Orca
programVersion: 5.0.3
elementType: Cl Cl O O O C C C C C C C C C C C C C C C C C C C C C H H H H H H H H H H H H H H H H H H H H
charge: 0
multiplicity: 1
keywords: wb97x-d3
keywords: def2-TZVPP
keywords: def2/J RIJCOSX
keywords: DEFGRID2
keywords: scfconv7
keywords: smallprint printgap noloewdin
keywords: NOSOSCF
formula: C21H20Cl2O3
InChI: InChI=1/C21H20Cl2O3/c1-21(2)17(12-18(22)23)19(21)20(24)25-13-14-7-6-10-16(11-14)26-15-8-4-3-5-9-15/h3-12,17,19H,13H2,1-2H3
46 atoms
Cl 3.091851 -0.720279 -2.422679
Cl 4.953178 -0.909286 -0.227302
O  -1.715007 -2.386616 1.111144
O  -1.556689 -2.41062 -1.116377
O  -0.913636 2.570144 1.05858
C  0.938863 -4.228845 -0.570044
C  1.388905 -2.812467 -0.77942
C  0.293977 -3.118918 0.231285
C  1.801565 -5.188899 0.213434
C  0.199867 -4.901246 -1.70049
C  2.674488 -2.312178 -0.281231
C  -1.06898 -2.616115 -0.031805
C  3.454235 -1.432766 -0.897733
C  -3.012218 -1.792169 1.026594
C  -2.955534 -0.371682 0.537718
C  -1.996283 0.501207 1.038219
C  -3.870623 0.083714 -0.402858
C  -1.939191 1.808727 0.578412
C  -3.816122 1.398798 -0.841775
C  -2.8480 2.270181 -0.367227
C  -1.044261 3.921658 1.217188
C  0.051963 4.701497 0.875609
C  -2.182329 4.500512 1.766283
C  0.009629 6.071707 1.089176
C  -2.215147 5.873879 1.961569
C  -1.124187 6.665071 1.626082
H  1.033817 -2.362894 -1.699759
H  0.590525 -3.081978 1.273658
H  1.20062 -6.031061 0.561451
H  2.598438 -5.589926 -0.415749
H  2.263111 -4.738426 1.091387
H  0.910311 -5.449818 -2.321419
H  -0.524673 -5.622148 -1.316738
H  -0.327849 -4.204654 -2.346654
H  3.024425 -2.678885 0.676485
H  -3.673172 -2.393615 0.399309
H  -3.396543 -1.8356 2.045906
H  -1.275051 0.172482 1.77765
H  -4.617149 -0.590884 -0.803339
H  -4.524109 1.748769 -1.58179
H  -2.802281 3.28429 -0.742857
H  0.934019 4.235695 0.453903
H  -3.033766 3.89394 2.049277
H  0.867803 6.676453 0.825368
H  -3.101677 6.324866 2.388565
H  -1.156728 7.734713 1.785862
elementType: Cl O C H
totalener: -1958.44989817 hartree
nucrepener: 2476.19934759 hartree
electener: -4434.64924576 hartree
oneelecener: -7606.75257681 hartree
twoeener: 3172.10333105 hartree
cpcmener: -0.02653661 hartree
kineticenergy: 1952.57066349 hartree
xcener: -143.508395641256 hartree
chargesum: 0.0000000
charge: -0.055831 -0.061706 -0.290609 -0.458386 -0.326211 0.090439 0.025016 -0.067043 -0.266084 -0.269080 -0.202550 0.386283 0.043071 0.106737 0.046466 -0.300270 -0.221901 0.299774 -0.125939 -0.216559 0.292750 -0.248985 -0.201048 -0.122153 -0.143996 -0.184551 0.079930 0.093303 0.098003 0.101080 0.090490 0.096208 0.098320 0.095582 0.127002 0.113806 0.121632 0.126238 0.141159 0.157975 0.155885 0.144360 0.157755 0.157515 0.158339 0.157782
qa: -0.0558 -0.0617 -0.2906 -0.4584 -0.3262 0.0904 0.0250 -0.0670 -0.2661 -0.2691 -0.2025 0.3863 0.0431 0.1067 0.0465 -0.3003 -0.2219 0.2998 -0.1259 -0.2166 0.2927 -0.2490 -0.2010 -0.1222 -0.1440 -0.1846 0.0799 0.0933 0.0980 0.1011 0.0905 0.0962 0.0983 0.0956 0.1270 0.1138 0.1216 0.1262 0.1412 0.1580 0.1559 0.1444 0.1578 0.1575 0.1583 0.1578
va: 1.2697 1.2430 2.1185 2.0501 2.0784 3.7384 3.8701 3.8242 3.9090 3.9016 3.9035 4.1814 4.2101 3.7907 3.6297 4.0606 3.9701 3.7264 3.8984 3.9261 3.6806 4.0098 3.9153 3.8856 3.8892 3.9034 1.0483 1.0344 1.0013 1.0008 1.0057 1.0001 0.9994 1.0208 1.0199 1.0082 0.9917 1.0315 1.0038 0.9906 0.9968 1.0089 0.9967 0.9892 0.9906 0.9905
dispcorr: -0.021533658 hartree
energy: -1958.471431830462
dipole: -24.77000 23.94662 -0.82339 -7.88447 7.24251 -0.64195 7.31339 -6.20220 1.11118
magnitude: 1.52473 au
magnitude: 3.87555 debye
