program: Orca
programVersion: 5.0.3
elementType: Cl Cl O O O C C C C C C C C C C C C C C C C C C C C C H H H H H H H H H H H H H H H H H H H H
charge: 0
multiplicity: 1
keywords: wb97x-d3
keywords: def2-TZVPP
keywords: def2/J RIJCOSX
keywords: DEFGRID2
keywords: scfconv7
keywords: smallprint printgap noloewdin
keywords: NOSOSCF
formula: C21H20Cl2O3
InChI: InChI=1/C21H20Cl2O3/c1-21(2)17(12-18(22)23)19(21)20(24)25-13-14-7-6-10-16(11-14)26-15-8-4-3-5-9-15/h3-12,17,19H,13H2,1-2H3
46 atoms
Cl 3.318891 -1.299998 -2.998982
Cl 5.271521 -1.020915 -0.894473
O  -1.521999 -2.183983 0.961839
O  -1.24909 -2.365154 -1.249972
O  -2.292987 2.848505 2.222485
C  1.158736 -4.169211 -0.263439
C  1.634864 -2.865003 -0.838814
C  0.562492 -2.867508 0.231386
C  2.020656 -4.917812 0.72473
C  0.368145 -5.0841 -1.166148
C  2.952759 -2.304972 -0.519828
C  -0.80846 -2.447931 -0.128957
C  3.730137 -1.634531 -1.360926
C  -2.873077 -1.729511 0.794068
C  -2.917852 -0.262787 0.475976
C  -2.554604 0.65507 1.455795
C  -3.300283 0.191109 -0.781113
C  -2.589226 2.014869 1.184583
C  -3.32695 1.553436 -1.043929
C  -2.973822 2.475328 -0.06991
C  -1.751198 4.08386 1.985189
C  -2.36709 5.180182 2.569195
C  -0.585084 4.231542 1.244373
C  -1.800508 6.438892 2.419913
C  -0.034515 5.496328 1.095736
C  -0.636445 6.602412 1.68229
H  1.267862 -2.658047 -1.837679
H  0.873218 -2.578734 1.22935
H  2.788821 -5.49488 0.206164
H  2.518435 -4.265878 1.441681
H  1.411161 -5.619503 1.297209
H  -0.171926 -4.557789 -1.950114
H  1.044822 -5.788535 -1.653711
H  -0.353787 -5.667615 -0.591142
H  3.330975 -2.437314 0.486824
H  -3.389235 -2.318434 0.034596
H  -3.347853 -1.929936 1.754102
H  -2.258356 0.317605 2.442824
H  -3.582254 -0.515181 -1.551475
H  -3.630927 1.907702 -2.020541
H  -3.014503 3.534731 -0.289343
H  -3.276417 5.047557 3.142211
H  -0.103584 3.370391 0.797112
H  -2.277754 7.29476 2.879823
H  0.87741 5.614101 0.52434
H  -0.197918 7.585204 1.567148
elementType: Cl O C H
totalener: -1958.45031410 hartree
nucrepener: 2436.90956155 hartree
electener: -4395.35987564 hartree
oneelecener: -7527.86214309 hartree
twoeener: 3132.50226745 hartree
cpcmener: -0.02526019 hartree
kineticenergy: 1952.56671578 hartree
xcener: -143.505193155207 hartree
chargesum: -0.0000000
charge: -0.056367 -0.062348 -0.283313 -0.466993 -0.327994 0.086815 0.029171 -0.080334 -0.269895 -0.266431 -0.205908 0.407823 0.043271 0.088524 -0.001996 -0.269986 -0.172045 0.265092 -0.156790 -0.180259 0.247517 -0.225354 -0.171392 -0.132034 -0.149500 -0.171751 0.076003 0.094837 0.101280 0.091591 0.097811 0.093411 0.097315 0.099711 0.128405 0.114431 0.126938 0.130387 0.140364 0.157722 0.154398 0.146036 0.157688 0.156871 0.158900 0.158376
qa: -0.0564 -0.0623 -0.2833 -0.4670 -0.3280 0.0868 0.0292 -0.0803 -0.2699 -0.2664 -0.2059 0.4078 0.0433 0.0885 -0.0020 -0.2700 -0.1720 0.2651 -0.1568 -0.1803 0.2475 -0.2254 -0.1714 -0.1320 -0.1495 -0.1718 0.0760 0.0948 0.1013 0.0916 0.0978 0.0934 0.0973 0.0997 0.1284 0.1144 0.1269 0.1304 0.1404 0.1577 0.1544 0.1460 0.1577 0.1569 0.1589 0.1584
va: 1.2691 1.2424 2.1278 2.0440 2.0678 3.7389 3.8570 3.8131 3.9098 3.9058 3.9049 4.1965 4.2110 3.7945 3.6523 4.0616 3.9174 3.7517 3.9380 3.8950 3.7156 4.0023 3.9224 3.8888 3.8933 3.8935 1.0523 1.0327 1.0006 1.0057 1.0015 1.0193 1.0003 0.9993 1.0198 1.0105 0.9944 1.0231 1.0127 0.9919 0.9983 1.0069 0.9961 0.9897 0.9904 0.9901
dispcorr: -0.021216098 hartree
energy: -1958.471530195294
dipole: -23.15604 22.78121 -0.37483 -5.87717 5.45534 -0.42183 11.96303 -10.92801 1.03501
magnitude: 1.17885 au
magnitude: 2.99640 debye
