program: Orca
programVersion: 5.0.3
elementType: Cl Cl O O O C C C C C C C C C C C C C C C C C C C C C H H H H H H H H H H H H H H H H H H H H
charge: 0
multiplicity: 1
keywords: wb97x-d3
keywords: def2-TZVPP
keywords: def2/J RIJCOSX
keywords: DEFGRID2
keywords: scfconv7
keywords: smallprint printgap noloewdin
keywords: NOSOSCF
formula: C21H20Cl2O3
InChI: InChI=1/C21H20Cl2O3/c1-21(2)17(12-18(22)23)19(21)20(24)25-13-14-7-6-10-16(11-14)26-15-8-4-3-5-9-15/h3-12,17,19H,13H2,1-2H3
46 atoms
Cl 4.037029 -3.381699 1.234086
Cl 4.869184 -4.209602 -1.402004
O  -1.708732 -1.413815 -0.894082
O  -0.674106 -1.333347 1.092721
O  -2.856414 3.517483 -0.069626
C  1.613697 -0.204369 -0.781489
C  1.940683 -1.592012 -0.304786
C  0.594306 -1.316131 -0.938971
C  2.222163 0.319975 -2.05953
C  1.426684 0.867876 0.263777
C  2.886045 -2.452896 -1.024235
C  -0.629422 -1.359831 -0.112598
C  3.796244 -3.239843 -0.46471
C  -3.006497 -1.421338 -0.304652
C  -3.644506 -0.058304 -0.321117
C  -2.89558 1.105452 -0.186572
C  -5.028218 0.025315 -0.442281
C  -3.537818 2.337452 -0.152748
C  -5.655759 1.261478 -0.416387
C  -4.918273 2.424713 -0.26543
C  -1.693502 3.616955 0.643746
C  -1.528853 3.021914 1.889263
C  -0.690564 4.407745 0.099913
C  -0.344256 3.221298 2.583104
C  0.483265 4.60917 0.811879
C  0.665498 4.01268 2.051621
H  1.919417 -1.712649 0.772433
H  0.459879 -1.663536 -1.957367
H  3.233642 0.690122 -1.880258
H  2.274956 -0.428345 -2.849441
H  1.628186 1.152634 -2.441368
H  2.377029 1.377772 0.434337
H  0.707861 1.617873 -0.074827
H  1.089956 0.479941 1.222606
H  2.84225 -2.456795 -2.106984
H  -3.599769 -2.117604 -0.89815
H  -2.967753 -1.811141 0.715021
H  -1.816293 1.069351 -0.109875
H  -5.615963 -0.876708 -0.562159
H  -6.73187 1.321841 -0.514034
H  -5.404782 3.391691 -0.244957
H  -2.312586 2.414059 2.323639
H  -0.834529 4.869426 -0.869035
H  -0.216107 2.756306 3.552267
H  1.261191 5.230716 0.387496
H  1.584666 4.165274 2.601723
elementType: Cl O C H
totalener: -1958.45005037 hartree
nucrepener: 2532.53304208 hartree
electener: -4490.98309245 hartree
oneelecener: -7718.60464245 hartree
twoeener: 3227.62155000 hartree
cpcmener: -0.02514987 hartree
kineticenergy: 1952.55006664 hartree
xcener: -143.507829410273 hartree
chargesum: 0.0000000
charge: -0.056127 -0.061749 -0.280831 -0.451084 -0.325788 0.121602 0.028479 -0.076462 -0.271988 -0.289118 -0.202922 0.366643 0.038659 0.081688 0.021201 -0.203193 -0.223632 0.277700 -0.108676 -0.255295 0.279974 -0.193693 -0.224243 -0.148902 -0.132855 -0.178945 0.078488 0.094891 0.101709 0.091705 0.100169 0.110097 0.069431 0.103792 0.128483 0.117953 0.112803 0.151789 0.138411 0.156701 0.144122 0.155669 0.143795 0.157971 0.155903 0.155668
qa: -0.0561 -0.0617 -0.2808 -0.4511 -0.3258 0.1216 0.0285 -0.0765 -0.2720 -0.2891 -0.2029 0.3666 0.0387 0.0817 0.0212 -0.2032 -0.2236 0.2777 -0.1087 -0.2553 0.2800 -0.1937 -0.2242 -0.1489 -0.1329 -0.1789 0.0785 0.0949 0.1017 0.0917 0.1002 0.1101 0.0694 0.1038 0.1285 0.1180 0.1128 0.1518 0.1384 0.1567 0.1441 0.1557 0.1438 0.1580 0.1559 0.1557
va: 1.2696 1.2429 2.1234 2.0513 2.0866 3.7257 3.8821 3.8386 3.9051 3.8977 3.8981 4.2436 4.2105 3.8403 3.6936 3.9402 3.9575 3.7610 3.8963 4.0042 3.6892 3.8908 3.9654 3.8441 3.8704 3.8574 1.0505 1.0342 1.0010 1.0058 1.0002 1.0019 1.0066 1.0142 1.0189 0.9958 1.0130 0.9698 1.0039 0.9892 1.0085 0.9963 1.0086 0.9914 0.9903 0.9919
dispcorr: -0.025047367 hartree
energy: -1958.475097733773
dipole: -21.78163 21.17164 -0.61000 28.54616 -28.08387 0.46228 -2.13412 1.12389 -1.01024
magnitude: 1.26743 au
magnitude: 3.22155 debye
