program: Orca
programVersion: 5.0.3
elementType: Cl Cl O O O C C C C C C C C C C C C C C C C C C C C C H H H H H H H H H H H H H H H H H H H H
charge: 0
multiplicity: 1
keywords: wb97x-d3
keywords: def2-TZVPP
keywords: def2/J RIJCOSX
keywords: DEFGRID2
keywords: scfconv7
keywords: smallprint printgap noloewdin
keywords: NOSOSCF
formula: C21H20Cl2O3
InChI: InChI=1/C21H20Cl2O3/c1-21(2)17(12-18(22)23)19(21)20(24)25-13-14-7-6-10-16(11-14)26-15-8-4-3-5-9-15/h3-12,17,19H,13H2,1-2H3
46 atoms
Cl 3.28515 -1.027487 -2.816482
Cl 5.141204 -0.845093 -0.614425
O  -1.646355 -2.302129 0.881894
O  -1.324094 -2.389682 -1.328138
O  -2.257708 2.739969 2.049561
C  1.123366 -4.163349 -0.417703
C  1.570916 -2.798128 -0.854448
C  0.461571 -2.935029 0.171469
C  1.982604 -4.966624 0.529246
C  0.404883 -5.021859 -1.4289
C  2.856514 -2.228673 -0.437336
C  -0.905738 -2.516087 -0.20309
C  3.645708 -1.475797 -1.19358
C  -2.995008 -1.850654 0.69727
C  -3.046371 -0.383197 0.381387
C  -2.59841 0.536017 1.326071
C  -3.52709 0.069302 -0.841165
C  -2.6479 1.893563 1.051128
C  -3.575387 1.431421 -1.105193
C  -3.139808 2.352767 -0.166321
C  -1.604955 3.90524 1.753103
C  -1.965452 5.035043 2.473597
C  -0.578277 3.95773 0.81757
C  -1.288344 6.226826 2.257053
C  0.081676 5.15881 0.60341
C  -0.267995 6.296733 1.318784
H  1.229927 -2.510587 -1.842401
H  0.726829 -2.728021 1.201982
H  2.798711 -5.451392 -0.01019
H  2.417952 -4.366561 1.327674
H  1.387489 -5.750125 1.002149
H  -0.124791 -4.44646 -2.185127
H  1.127808 -5.654607 -1.947584
H  -0.314581 -5.679941 -0.937246
H  3.197424 -2.427741 0.5717
H  -3.498944 -2.438677 -0.071685
H  -3.482839 -2.056632 1.649928
H  -2.220317 0.20092 2.28547
H  -3.869007 -0.639297 -1.585073
H  -3.957982 1.78391 -2.054575
H  -3.193555 3.412471 -0.38093
H  -2.765532 4.978435 3.201259
H  -0.287711 3.073809 0.263584
H  -1.567975 7.106227 2.822646
H  0.881514 5.199946 -0.125049
H  0.253453 7.229363 1.148331
elementType: Cl O C H
totalener: -1958.45053153 hartree
nucrepener: 2454.82033520 hartree
electener: -4413.27086673 hartree
oneelecener: -7563.67628858 hartree
twoeener: 3150.40542185 hartree
cpcmener: -0.02535810 hartree
kineticenergy: 1952.56473217 hartree
xcener: -143.505537507966 hartree
chargesum: -0.0000000
charge: -0.056615 -0.061914 -0.285238 -0.465204 -0.329168 0.086739 0.029711 -0.081155 -0.269039 -0.266834 -0.205344 0.406024 0.043479 0.091999 0.006551 -0.274337 -0.179475 0.267358 -0.145922 -0.188248 0.273460 -0.242563 -0.185315 -0.125138 -0.147823 -0.182352 0.076173 0.094599 0.101141 0.091525 0.098050 0.093697 0.096874 0.099432 0.128849 0.114339 0.127274 0.130656 0.141411 0.158035 0.156655 0.145195 0.157573 0.157714 0.159029 0.158141
qa: -0.0566 -0.0619 -0.2852 -0.4652 -0.3292 0.0867 0.0297 -0.0812 -0.2690 -0.2668 -0.2053 0.4060 0.0435 0.0920 0.0066 -0.2743 -0.1795 0.2674 -0.1459 -0.1882 0.2735 -0.2426 -0.1853 -0.1251 -0.1478 -0.1824 0.0762 0.0946 0.1011 0.0915 0.0981 0.0937 0.0969 0.0994 0.1288 0.1143 0.1273 0.1307 0.1414 0.1580 0.1567 0.1452 0.1576 0.1577 0.1590 0.1581
va: 1.2687 1.2428 2.1257 2.0463 2.0702 3.7333 3.8555 3.8199 3.9105 3.9052 3.9049 4.1903 4.2093 3.7949 3.6428 4.0620 3.9278 3.7477 3.9232 3.9088 3.6994 4.0052 3.9071 3.8872 3.8945 3.9024 1.0522 1.0330 1.0007 1.0055 1.0015 1.0196 1.0003 0.9992 1.0193 1.0095 0.9934 1.0239 1.0097 0.9914 0.9960 1.0082 0.9966 0.9893 0.9904 0.9904
dispcorr: -0.021303924 hartree
energy: -1958.471835454790
dipole: -22.42300 22.02893 -0.39407 -7.72284 7.09006 -0.63277 9.13864 -8.24635 0.89228
magnitude: 1.16270 au
magnitude: 2.95534 debye
