program: Orca
programVersion: 5.0.3
elementType: Cl Cl O O O C C C C C C C C C C C C C C C C C C C C C H H H H H H H H H H H H H H H H H H H H
charge: 0
multiplicity: 1
keywords: wb97x-d3
keywords: def2-TZVPP
keywords: def2/J RIJCOSX
keywords: DEFGRID2
keywords: scfconv7
keywords: smallprint printgap noloewdin
keywords: NOSOSCF
formula: C21H20Cl2O3
InChI: InChI=1/C21H20Cl2O3/c1-21(2)17(12-18(22)23)19(21)20(24)25-13-14-7-6-10-16(11-14)26-15-8-4-3-5-9-15/h3-12,17,19H,13H2,1-2H3
46 atoms
Cl 1.930734 0.777451 0.207457
Cl 3.813646 -0.141832 2.190554
O  -1.945383 -2.695571 0.444446
O  -1.280928 -2.234577 -1.637358
O  -1.45653 2.245459 1.24586
C  1.377028 -3.673185 -0.880689
C  1.507596 -2.255355 -0.423019
C  0.282536 -3.08022 -0.023933
C  2.199682 -4.751264 -0.214316
C  1.175788 -3.926727 -2.35535
C  2.446741 -1.833219 0.625229
C  -1.031335 -2.635834 -0.527241
C  2.698277 -0.570502 0.948711
C  -3.24028 -2.172441 0.1671
C  -3.257135 -0.673189 0.038297
C  -2.306786 0.121553 0.670706
C  -4.272273 -0.067869 -0.693556
C  -2.382739 1.500682 0.563483
C  -4.343933 1.315083 -0.782099
C  -3.399858 2.112909 -0.155066
C  -0.586992 3.048813 0.56988
C  0.114147 3.969747 1.341034
C  -0.354284 2.95566 -0.797389
C  1.049052 4.79748 0.741442
C  0.5815 3.799226 -1.383659
C  1.28696 4.721302 -0.625307
H  1.299735 -1.51381 -1.187039
H  0.272213 -3.4223 1.004562
H  3.218833 -4.756572 -0.605576
H  2.256284 -4.643092 0.868689
H  1.763723 -5.731268 -0.415693
H  0.561846 -4.814424 -2.51791
H  0.711505 -3.094629 -2.877966
H  2.145003 -4.108857 -2.823604
H  2.971246 -2.596122 1.187997
H  -3.667534 -2.639454 -0.723038
H  -3.847654 -2.480599 1.019286
H  -1.505152 -0.313237 1.255585
H  -5.011349 -0.678571 -1.1981
H  -5.141037 1.777301 -1.349748
H  -3.454604 3.19224 -0.224389
H  -0.070774 4.028783 2.406569
H  -0.878432 2.233806 -1.410107
H  1.591747 5.510203 1.349259
H  0.760359 3.722704 -2.448631
H  2.014668 5.372063 -1.09185
elementType: Cl O C H
totalener: -1958.44822084 hartree
nucrepener: 2641.05171165 hartree
electener: -4599.49993249 hartree
oneelecener: -7936.72473567 hartree
twoeener: 3337.22480318 hartree
cpcmener: -0.02626718 hartree
kineticenergy: 1952.56602143 hartree
xcener: -143.509673988416 hartree
chargesum: -0.0000000
charge: -0.049794 -0.061212 -0.293829 -0.455597 -0.319690 0.125240 -0.044309 -0.044439 -0.288249 -0.272119 -0.168561 0.367688 0.040219 0.098062 0.022698 -0.231406 -0.206286 0.236130 -0.128210 -0.185631 0.312108 -0.252720 -0.244257 -0.116935 -0.137131 -0.196475 0.096033 0.097626 0.105792 0.090271 0.099644 0.099681 0.095547 0.094948 0.128410 0.116480 0.123312 0.127745 0.141781 0.158329 0.156246 0.142639 0.148061 0.156300 0.158603 0.157256
qa: -0.0498 -0.0612 -0.2938 -0.4556 -0.3197 0.1252 -0.0443 -0.0444 -0.2882 -0.2721 -0.1686 0.3677 0.0402 0.0981 0.0227 -0.2314 -0.2063 0.2361 -0.1282 -0.1856 0.3121 -0.2527 -0.2443 -0.1169 -0.1371 -0.1965 0.0960 0.0976 0.1058 0.0903 0.0996 0.0997 0.0955 0.0949 0.1284 0.1165 0.1233 0.1277 0.1418 0.1583 0.1562 0.1426 0.1481 0.1563 0.1586 0.1573
va: 1.2971 1.2461 2.1153 2.0448 2.0651 3.7779 3.9101 3.7802 3.9165 3.8854 3.8726 4.1821 4.2188 3.7957 3.6532 4.0457 3.9702 3.7549 3.8855 3.9571 3.6096 4.0022 3.8389 3.8935 3.8771 3.9119 1.0367 1.0333 0.9989 1.0031 1.0016 0.9997 1.0210 1.0002 1.0195 1.0097 0.9915 1.0318 1.0021 0.9898 0.9964 1.0102 1.0092 0.9890 0.9896 0.9903
dispcorr: -0.025301000 hartree
energy: -1958.473521841218
dipole: -11.50393 11.18503 -0.31890 -14.79912 13.46893 -1.33019 -13.94495 13.93416 -0.01079
magnitude: 1.36793 au
magnitude: 3.47699 debye
