program: Orca
programVersion: 5.0.3
elementType: Cl Cl O O O C C C C C C C C C C C C C C C C C C C C C H H H H H H H H H H H H H H H H H H H H
charge: 0
multiplicity: 1
keywords: wb97x-d3
keywords: def2-TZVPP
keywords: def2/J RIJCOSX
keywords: DEFGRID2
keywords: scfconv7
keywords: smallprint printgap noloewdin
keywords: NOSOSCF
formula: C21H20Cl2O3
InChI: InChI=1/C21H20Cl2O3/c1-21(2)17(12-18(22)23)19(21)20(24)25-13-14-7-6-10-16(11-14)26-15-8-4-3-5-9-15/h3-12,17,19H,13H2,1-2H3
46 atoms
Cl 3.307081 -2.695206 1.552968
Cl 5.043215 -4.467927 0.073197
O  -0.970427 -1.701985 0.875791
O  0.370639 -0.015384 0.280775
O  -3.382882 3.609816 0.039291
C  0.9218 -2.100783 -2.067193
C  2.107505 -1.927797 -1.178327
C  0.76775 -2.223797 -0.556385
C  0.761404 -3.388798 -2.836407
C  0.382484 -0.895692 -2.796224
C  3.186479 -2.9380 -1.112884
C  0.072315 -1.184185 0.227436
C  3.764693 -3.317532 0.017239
C  -1.831622 -0.798981 1.576034
C  -2.608932 0.071276 0.628586
C  -2.602894 1.449589 0.791827
C  -3.336956 -0.500937 -0.411536
C  -3.312587 2.253057 -0.092631
C  -4.047276 0.310177 -1.282095
C  -4.032791 1.689511 -1.135478
C  -2.307149 4.349271 0.442989
C  -2.590965 5.503356 1.162075
C  -0.995328 4.026955 0.11374
C  -1.556533 6.338897 1.555026
C  0.029839 4.867697 0.525288
C  -0.24077 6.023277 1.24501
H  2.448719 -0.902568 -1.055334
H  0.605894 -3.236752 -0.204179
H  1.307476 -3.345678 -3.781092
H  1.120795 -4.257215 -2.283056
H  -0.289885 -3.562911 -3.072487
H  -0.696903 -0.975455 -2.940346
H  0.584048 0.042621 -2.283168
H  0.840997 -0.829442 -3.784725
H  3.549116 -3.373907 -2.037081
H  -2.499383 -1.447627 2.143116
H  -1.265596 -0.198401 2.290851
H  -2.038729 1.887351 1.60671
H  -3.355033 -1.575859 -0.542602
H  -4.615544 -0.131669 -2.090334
H  -4.58078 2.324703 -1.820112
H  -3.618059 5.746033 1.405269
H  -0.761235 3.134649 -0.453469
H  -1.78428 7.238271 2.11275
H  1.051197 4.613371 0.272595
H  0.565768 6.672609 1.558938
elementType: Cl O C H
totalener: -1958.44763809 hartree
nucrepener: 2506.02808156 hartree
electener: -4464.47571965 hartree
oneelecener: -7666.24732374 hartree
twoeener: 3201.77160408 hartree
cpcmener: -0.02444522 hartree
kineticenergy: 1952.57576261 hartree
xcener: -143.508187954670 hartree
chargesum: 0.0000000
charge: -0.050710 -0.057507 -0.281091 -0.457421 -0.327043 0.140292 -0.032449 -0.141506 -0.283792 -0.269271 -0.217609 0.394206 0.071264 0.094155 0.045160 -0.225486 -0.276349 0.304625 -0.099626 -0.258887 0.314774 -0.263663 -0.212583 -0.114403 -0.141166 -0.194265 0.109410 0.112253 0.101172 0.093889 0.099303 0.095290 0.092884 0.099632 0.139443 0.124822 0.114228 0.143383 0.139330 0.156968 0.145796 0.143267 0.156850 0.157440 0.157657 0.157338
qa: -0.0507 -0.0575 -0.2811 -0.4574 -0.3270 0.1403 -0.0324 -0.1415 -0.2838 -0.2693 -0.2176 0.3942 0.0713 0.0942 0.0452 -0.2255 -0.2763 0.3046 -0.0996 -0.2589 0.3148 -0.2637 -0.2126 -0.1144 -0.1412 -0.1943 0.1094 0.1123 0.1012 0.0939 0.0993 0.0953 0.0929 0.0996 0.1394 0.1248 0.1142 0.1434 0.1393 0.1570 0.1458 0.1433 0.1569 0.1574 0.1577 0.1573
va: 1.2792 1.2486 2.1171 2.0484 2.0848 3.7156 3.8775 3.8012 3.9121 3.8952 3.9020 4.1861 4.1899 3.7993 3.5963 3.9387 3.9566 3.7012 3.8729 4.0234 3.6780 4.0106 3.9069 3.8789 3.8930 3.9136 1.0250 1.0242 0.9996 0.9990 1.0028 1.0012 1.0151 1.0029 1.0082 0.9916 1.0100 1.0076 1.0122 0.9889 1.0070 1.0100 0.9992 0.9890 0.9910 0.9908
dispcorr: -0.023700722 hartree
energy: -1958.471338811276
dipole: -24.23693 23.75020 -0.48672 17.15895 -17.97337 -0.81443 -16.17505 15.33524 -0.83982
magnitude: 1.26708 au
magnitude: 3.22065 debye
