program: Orca
programVersion: 5.0.3
elementType: Cl Cl O O O C C C C C C C C C C C C C C C C C C C C C H H H H H H H H H H H H H H H H H H H H
charge: 0
multiplicity: 1
keywords: wb97x-d3
keywords: def2-TZVPP
keywords: def2/J RIJCOSX
keywords: DEFGRID2
keywords: scfconv7
keywords: smallprint printgap noloewdin
keywords: NOSOSCF
formula: C21H20Cl2O3
InChI: InChI=1/C21H20Cl2O3/c1-21(2)17(12-18(22)23)19(21)20(24)25-13-14-7-6-10-16(11-14)26-15-8-4-3-5-9-15/h3-12,17,19H,13H2,1-2H3
46 atoms
Cl 1.931256 0.793678 0.236523
Cl 3.817292 -0.154464 2.204605
O  -1.95514 -2.707723 0.449678
O  -1.303539 -2.220972 -1.630172
O  -1.46446 2.239011 1.23268
C  1.369798 -3.641275 -0.905473
C  1.488529 -2.232004 -0.417298
C  0.272523 -3.077537 -0.034093
C  2.202822 -4.727003 -0.264866
C  1.169993 -3.862035 -2.385544
C  2.429412 -1.823775 0.634395
C  -1.045763 -2.631656 -0.52532
C  2.692205 -0.565209 0.965566
C  -3.252877 -2.185212 0.183687
C  -3.270109 -0.686445 0.047969
C  -2.319407 0.111753 0.676155
C  -4.283023 -0.085086 -0.690111
C  -2.392908 1.490021 0.557848
C  -4.352277 1.297323 -0.78938
C  -3.407871 2.098289 -0.167158
C  -0.595887 3.035544 0.5468
C  0.101259 3.969581 1.305582
C  -0.360457 2.922539 -0.818515
C  1.035584 4.790265 0.695321
C  0.574524 3.759147 -1.415652
C  1.27624 4.69418 -0.669692
H  1.271592 -1.476296 -1.164597
H  0.266203 -3.441971 0.986748
H  2.260524 -4.642801 0.820197
H  1.773528 -5.705513 -0.487022
H  3.221224 -4.715963 -0.657866
H  0.701215 -3.020534 -2.888632
H  2.140497 -4.027292 -2.857361
H  0.561183 -4.749191 -2.569036
H  2.946501 -2.594758 1.193157
H  -3.688685 -2.655757 -0.700436
H  -3.851337 -2.490396 1.043213
H  -1.515948 -0.319905 1.26125
H  -5.021566 -0.69841 -1.192265
H  -5.147389 1.756602 -1.362206
H  -3.459434 3.177117 -0.246126
H  -0.085051 4.042717 2.370031
H  -0.882161 2.190322 -1.420917
H  1.576468 5.512545 1.293391
H  0.755259 3.667596 -2.479143
H  2.003235 5.339654 -1.144631
elementType: Cl O C H
totalener: -1958.44809502 hartree
nucrepener: 2642.94259089 hartree
electener: -4601.39068591 hartree
oneelecener: -7940.50595082 hartree
twoeener: 3339.11526490 hartree
cpcmener: -0.02625095 hartree
kineticenergy: 1952.56525561 hartree
xcener: -143.509685484262 hartree
chargesum: 0.0000000
charge: -0.049414 -0.061414 -0.293743 -0.455253 -0.320082 0.124932 -0.042666 -0.043255 -0.288343 -0.272294 -0.171441 0.367125 0.042353 0.098606 0.022629 -0.232868 -0.205872 0.237154 -0.128351 -0.185106 0.308186 -0.250574 -0.240565 -0.117673 -0.139076 -0.195231 0.095277 0.097464 0.090620 0.099728 0.105608 0.095426 0.094881 0.099542 0.128017 0.116485 0.123030 0.127398 0.141700 0.158396 0.156297 0.142567 0.147777 0.156346 0.158403 0.157272
qa: -0.0494 -0.0614 -0.2937 -0.4553 -0.3201 0.1249 -0.0427 -0.0433 -0.2883 -0.2723 -0.1714 0.3671 0.0424 0.0986 0.0226 -0.2329 -0.2059 0.2372 -0.1284 -0.1851 0.3082 -0.2506 -0.2406 -0.1177 -0.1391 -0.1952 0.0953 0.0975 0.0906 0.0997 0.1056 0.0954 0.0949 0.0995 0.1280 0.1165 0.1230 0.1274 0.1417 0.1584 0.1563 0.1426 0.1478 0.1563 0.1584 0.1573
va: 1.2981 1.2458 2.1150 2.0448 2.0644 3.7751 3.9107 3.7793 3.9166 3.8854 3.8767 4.1830 4.2185 3.7949 3.6520 4.0458 3.9700 3.7538 3.8864 3.9567 3.6100 4.0007 3.8376 3.8943 3.8781 3.9102 1.0368 1.0334 1.0032 1.0015 0.9990 1.0210 1.0002 0.9997 1.0197 1.0093 0.9916 1.0316 1.0022 0.9898 0.9964 1.0102 1.0094 0.9889 0.9897 0.9903
dispcorr: -0.025351994 hartree
energy: -1958.473447009826
dipole: -11.53276 11.21690 -0.31586 -14.68773 13.35443 -1.33330 -14.30677 14.27724 -0.02954
magnitude: 1.37053 au
magnitude: 3.48360 debye
