program: Orca
programVersion: 5.0.3
elementType: Cl Cl O O O C C C C C C C C C C C C C C C C C C C C C H H H H H H H H H H H H H H H H H H H H
charge: 0
multiplicity: 1
keywords: wb97x-d3
keywords: def2-TZVPP
keywords: def2/J RIJCOSX
keywords: DEFGRID2
keywords: scfconv7
keywords: smallprint printgap noloewdin
keywords: NOSOSCF
formula: C21H20Cl2O3
InChI: InChI=1/C21H20Cl2O3/c1-21(2)17(12-18(22)23)19(21)20(24)25-13-14-7-6-10-16(11-14)26-15-8-4-3-5-9-15/h3-12,17,19H,13H2,1-2H3
46 atoms
Cl 1.919463 0.709597 0.109785
Cl 4.100043 -0.074351 1.8354
O  -1.876796 -2.648099 0.704622
O  -1.284877 -2.262063 -1.413243
O  -1.419433 2.339381 1.191587
C  1.339437 -3.786285 -0.702986
C  1.554851 -2.340184 -0.398372
C  0.333207 -3.061941 0.166046
C  2.165589 -4.830561 0.010406
C  1.015199 -4.172589 -2.125977
C  2.597067 -1.862648 0.523293
C  -0.996982 -2.625564 -0.29919
C  2.836443 -0.582402 0.780196
C  -3.186593 -2.152933 0.444296
C  -3.225195 -0.664875 0.225657
C  -2.267303 0.176387 0.782116
C  -4.263612 -0.116326 -0.517847
C  -2.358259 1.544606 0.587125
C  -4.349162 1.257337 -0.695105
C  -3.396619 2.101257 -0.146532
C  -0.615283 3.135299 0.429564
C  -0.352985 2.890259 -0.913621
C  -0.015213 4.207498 1.080051
C  0.513271 3.732372 -1.599122
C  0.851289 5.033995 0.382605
C  1.118924 4.804799 -0.961091
H  1.317061 -1.664634 -1.213687
H  0.38132 -3.307036 1.220676
H  1.673846 -5.802782 -0.053051
H  3.149036 -4.928416 -0.453435
H  2.312071 -4.61381 1.068633
H  0.352535 -5.039465 -2.154938
H  0.549858 -3.372629 -2.695764
H  1.937185 -4.447818 -2.642107
H  3.220364 -2.591024 1.0291
H  -3.639082 -2.676428 -0.40095
H  -3.759707 -2.41579 1.334504
H  -1.445207 -0.214506 1.369798
H  -5.008464 -0.763972 -0.964449
H  -5.163853 1.675458 -1.272084
H  -3.461141 3.173118 -0.287276
H  -0.804291 2.052519 -1.429562
H  -0.226374 4.387767 2.126899
H  0.716853 3.537313 -2.644301
H  1.314689 5.867418 0.894908
H  1.792569 5.454883 -1.503549
elementType: Cl O C H
totalener: -1958.44869319 hartree
nucrepener: 2631.76945269 hartree
electener: -4590.21814587 hartree
oneelecener: -7918.19413892 hartree
twoeener: 3327.97599305 hartree
cpcmener: -0.02635810 hartree
kineticenergy: 1952.56438887 hartree
xcener: -143.508769832444 hartree
chargesum: 0.0000000
charge: -0.051017 -0.059860 -0.294577 -0.456853 -0.321110 0.123634 -0.058853 -0.036818 -0.288433 -0.271130 -0.162981 0.366903 0.036089 0.099636 0.022065 -0.235533 -0.205045 0.232504 -0.132462 -0.175377 0.308368 -0.254048 -0.248241 -0.130750 -0.117518 -0.195346 0.098466 0.098256 0.099548 0.105816 0.089958 0.100132 0.095865 0.095326 0.131562 0.116536 0.122654 0.126327 0.141856 0.158653 0.156907 0.153701 0.143590 0.158910 0.156141 0.156547
qa: -0.0510 -0.0599 -0.2946 -0.4569 -0.3211 0.1236 -0.0589 -0.0368 -0.2884 -0.2711 -0.1630 0.3669 0.0361 0.0996 0.0221 -0.2355 -0.2050 0.2325 -0.1325 -0.1754 0.3084 -0.2540 -0.2482 -0.1308 -0.1175 -0.1953 0.0985 0.0983 0.0995 0.1058 0.0900 0.1001 0.0959 0.0953 0.1316 0.1165 0.1227 0.1263 0.1419 0.1587 0.1569 0.1537 0.1436 0.1589 0.1561 0.1565
va: 1.2932 1.2476 2.1163 2.0433 2.0611 3.7898 3.9095 3.7763 3.9176 3.8830 3.8613 4.1777 4.2225 3.7933 3.6512 4.0383 3.9687 3.7630 3.8917 3.9493 3.6070 3.8255 4.0074 3.8757 3.8920 3.9137 1.0339 1.0325 1.0018 0.9987 1.0020 0.9994 1.0207 1.0003 1.0175 1.0093 0.9917 1.0338 1.0021 0.9898 0.9960 1.0066 1.0095 0.9892 0.9891 0.9906
dispcorr: -0.025114891 hartree
energy: -1958.473808077257
dipole: -12.91972 12.62672 -0.29301 -15.52212 14.16613 -1.35599 -12.07892 12.12685 0.04793
magnitude: 1.38811 au
magnitude: 3.52830 debye
