program: Orca
programVersion: 5.0.3
elementType: Cl Cl O O O C C C C C C C C C C C C C C C C C C C C C H H H H H H H H H H H H H H H H H H H H
charge: 0
multiplicity: 1
keywords: wb97x-d3
keywords: def2-TZVPP
keywords: def2/J RIJCOSX
keywords: DEFGRID2
keywords: scfconv7
keywords: smallprint printgap noloewdin
keywords: NOSOSCF
formula: C21H20Cl2O3
InChI: InChI=1/C21H20Cl2O3/c1-21(2)17(12-18(22)23)19(21)20(24)25-13-14-7-6-10-16(11-14)26-15-8-4-3-5-9-15/h3-12,17,19H,13H2,1-2H3
46 atoms
Cl 3.648267 0.269503 -1.211913
Cl 4.319718 0.504663 1.583377
O  -2.014467 -2.185104 0.113749
O  -0.890988 -2.027293 -1.820271
O  -2.471887 2.96986 -0.227351
C  1.3658 -3.428687 -0.146823
C  1.632096 -1.954435 -0.249675
C  0.276364 -2.44607 0.226098
C  1.956541 -4.219351 0.995989
C  1.288262 -4.219588 -1.430168
C  2.492981 -1.242856 0.701768
C  -0.906192 -2.198972 -0.62504
C  3.366082 -0.293613 0.388806
C  -3.274109 -1.874897 -0.494573
C  -3.70066 -0.483613 -0.118478
C  -2.859807 0.59865 -0.362572
C  -4.942628 -0.268615 0.468374
C  -3.256611 1.875771 0.005952
C  -5.343481 1.018993 0.798811
C  -4.501408 2.097087 0.581272
C  -1.120992 2.901272 -0.015351
C  -0.571768 2.229198 1.071232
C  -0.307123 3.588413 -0.905127
C  0.804048 2.24263 1.25168
C  1.065927 3.603615 -0.704097
C  1.628845 2.928525 0.369624
H  1.639311 -1.571728 -1.263836
H  0.087079 -2.363163 1.290395
H  3.001349 -4.462228 0.793908
H  1.912687 -3.695343 1.950002
H  1.416973 -5.160053 1.119577
H  0.569381 -5.036868 -1.340605
H  1.010564 -3.617967 -2.292535
H  2.2631 -4.6632 -1.642842
H  2.409767 -1.497461 1.751546
H  -3.222529 -1.994029 -1.578149
H  -3.986037 -2.607384 -0.112464
H  -1.900784 0.45451 -0.846182
H  -5.598779 -1.106691 0.668497
H  -6.313543 1.183161 1.250405
H  -4.802298 3.100788 0.854464
H  -1.202035 1.702334 1.776898
H  -0.746751 4.11024 -1.746129
H  1.229583 1.719868 2.098778
H  1.697705 4.14268 -1.398768
H  2.699912 2.940815 0.519671
elementType: Cl O C H
totalener: -1958.44931363 hartree
nucrepener: 2618.70752066 hartree
electener: -4577.15683428 hartree
oneelecener: -7891.26093887 hartree
twoeener: 3314.10410458 hartree
cpcmener: -0.02482015 hartree
kineticenergy: 1952.54241767 hartree
xcener: -143.504636324150 hartree
chargesum: -0.0000000
charge: -0.056113 -0.062976 -0.282031 -0.468358 -0.330353 0.086697 0.043735 -0.073751 -0.266862 -0.270332 -0.215819 0.395520 0.046940 0.092817 0.002330 -0.180822 -0.230861 0.251521 -0.104886 -0.248134 0.286609 -0.191344 -0.248271 -0.138370 -0.126649 -0.173213 0.079685 0.095588 0.100757 0.089589 0.098307 0.100075 0.095313 0.096679 0.129898 0.116647 0.112400 0.152781 0.143203 0.157581 0.145249 0.153000 0.144518 0.150545 0.156125 0.145031
qa: -0.0561 -0.0630 -0.2820 -0.4684 -0.3304 0.0867 0.0437 -0.0738 -0.2669 -0.2703 -0.2158 0.3955 0.0469 0.0928 0.0023 -0.1808 -0.2309 0.2515 -0.1049 -0.2481 0.2866 -0.1913 -0.2483 -0.1384 -0.1266 -0.1732 0.0797 0.0956 0.1008 0.0896 0.0983 0.1001 0.0953 0.0967 0.1299 0.1166 0.1124 0.1528 0.1432 0.1576 0.1452 0.1530 0.1445 0.1505 0.1561 0.1450
va: 1.2665 1.2392 2.1310 2.0329 2.0750 3.7458 3.8293 3.8457 3.9115 3.9051 3.8995 4.1873 4.1857 3.8066 3.7430 3.9012 3.9676 3.7635 3.8899 4.0187 3.6859 3.9234 4.0203 3.8345 3.9340 3.8409 1.0499 1.0345 1.0004 1.0060 1.0013 0.9989 1.0191 1.0000 1.0189 1.0182 1.0009 1.0121 1.0039 0.9888 1.0066 0.9992 1.0079 0.9976 0.9904 1.0112
dispcorr: -0.025819198 hartree
energy: -1958.475132823298
dipole: -18.51664 17.93584 -0.58080 -18.11137 16.64200 -1.46937 0.97154 0.24949 1.22103
magnitude: 1.99682 au
magnitude: 5.07551 debye
