program: Orca
programVersion: 5.0.3
elementType: Cl Cl O O O C C C C C C C C C C C C C C C C C C C C C H H H H H H H H H H H H H H H H H H H H
charge: 0
multiplicity: 1
keywords: wb97x-d3
keywords: def2-TZVPP
keywords: def2/J RIJCOSX
keywords: DEFGRID2
keywords: scfconv7
keywords: smallprint printgap noloewdin
keywords: NOSOSCF
formula: C21H20Cl2O3
InChI: InChI=1/C21H20Cl2O3/c1-21(2)17(12-18(22)23)19(21)20(24)25-13-14-7-6-10-16(11-14)26-15-8-4-3-5-9-15/h3-12,17,19H,13H2,1-2H3
46 atoms
Cl 4.388589 -1.420886 -0.71853
Cl 5.118108 -3.178101 1.450616
O  -1.769957 -2.312649 0.236823
O  -0.679177 -1.398288 -1.484425
O  -2.36194 3.448592 -0.610463
C  0.874859 -4.136869 -1.412506
C  1.690714 -3.060141 -0.755905
C  0.250112 -3.282582 -0.330371
C  1.110113 -5.584036 -1.052038
C  0.50751 -3.946521 -2.863243
C  2.759688 -3.367701 0.200534
C  -0.747646 -2.231055 -0.613856
C  3.92485 -2.738445 0.287435
C  -2.784752 -1.309844 0.144522
C  -2.288259 0.036206 0.592337
C  -2.5547 1.160426 -0.17518
C  -1.580398 0.169204 1.784034
C  -2.1130 2.41046 0.239195
C  -1.135609 1.419519 2.182574
C  -1.391024 2.549009 1.416869
C  -2.556685 4.720128 -0.147241
C  -2.002534 5.749558 -0.895614
C  -3.330442 4.996585 0.97401
C  -2.23016 7.066119 -0.522348
C  -3.537677 6.318004 1.343136
C  -2.992347 7.35694 0.600639
H  1.846643 -2.180158 -1.36959
H  0.105971 -3.787463 0.61816
H  0.23747 -6.183105 -1.318627
H  1.965537 -5.98228 -1.601086
H  1.294087 -5.737587 0.010653
H  1.268829 -4.409574 -3.493835
H  -0.44491 -4.430248 -3.089404
H  0.433639 -2.90217 -3.156838
H  2.591089 -4.173198 0.905087
H  -3.191589 -1.262537 -0.867776
H  -3.57738 -1.66609 0.803089
H  -3.097522 1.069041 -1.108884
H  -1.371131 -0.697023 2.399263
H  -0.57568 1.522796 3.103104
H  -1.021586 3.514156 1.738435
H  -1.40569 5.518399 -1.769144
H  -3.774648 4.197333 1.553921
H  -1.802008 7.866633 -1.111812
H  -4.138437 6.533597 2.217413
H  -3.163651 8.38455 0.892943
elementType: Cl O C H
totalener: -1958.44986180 hartree
nucrepener: 2419.18926062 hartree
electener: -4377.63912242 hartree
oneelecener: -7492.60545973 hartree
twoeener: 3114.96633731 hartree
cpcmener: -0.02666076 hartree
kineticenergy: 1952.57107497 hartree
xcener: -143.508179954706 hartree
chargesum: -0.0000000
charge: -0.055508 -0.062039 -0.288317 -0.459212 -0.325585 0.084499 0.032689 -0.076444 -0.263911 -0.266803 -0.204391 0.390773 0.040802 0.103785 0.044383 -0.265565 -0.251220 0.296162 -0.125837 -0.215531 0.295479 -0.250598 -0.204310 -0.120981 -0.142543 -0.186527 0.078740 0.093607 0.098059 0.100884 0.090349 0.096904 0.098542 0.094429 0.128282 0.114582 0.122941 0.130027 0.140296 0.158390 0.154292 0.145229 0.156743 0.157787 0.159005 0.157662
qa: -0.0555 -0.0620 -0.2883 -0.4592 -0.3256 0.0845 0.0327 -0.0764 -0.2639 -0.2668 -0.2044 0.3908 0.0408 0.1038 0.0444 -0.2656 -0.2512 0.2962 -0.1258 -0.2155 0.2955 -0.2506 -0.2043 -0.1210 -0.1425 -0.1865 0.0787 0.0936 0.0981 0.1009 0.0903 0.0969 0.0985 0.0944 0.1283 0.1146 0.1229 0.1300 0.1403 0.1584 0.1543 0.1452 0.1567 0.1578 0.1590 0.1577
va: 1.2702 1.2429 2.1202 2.0523 2.0793 3.7410 3.8598 3.8263 3.9078 3.9032 3.9008 4.1880 4.2106 3.7893 3.6334 4.0610 3.9706 3.7257 3.8999 3.9313 3.6819 4.0092 3.9182 3.8834 3.8905 3.9064 1.0493 1.0345 1.0015 1.0010 1.0056 1.0000 0.9997 1.0208 1.0193 1.0092 0.9910 1.0210 1.0121 0.9906 0.9976 1.0087 0.9971 0.9891 0.9902 0.9906
dispcorr: -0.021279808 hartree
energy: -1958.471141604588
dipole: -29.56495 28.45870 -1.10625 1.67718 -2.65909 -0.98191 -5.51290 6.45386 0.94096
magnitude: 1.75309 au
magnitude: 4.45601 debye
