program: Orca
programVersion: 5.0.3
elementType: Cl Cl O O O C C C C C C C C C C C C C C C C C C C C C H H H H H H H H H H H H H H H H H H H H
charge: 0
multiplicity: 1
keywords: wb97x-d3
keywords: def2-TZVPP
keywords: def2/J RIJCOSX
keywords: DEFGRID2
keywords: scfconv7
keywords: smallprint printgap noloewdin
keywords: NOSOSCF
formula: C21H20Cl2O3
InChI: InChI=1/C21H20Cl2O3/c1-21(2)17(12-18(22)23)19(21)20(24)25-13-14-7-6-10-16(11-14)26-15-8-4-3-5-9-15/h3-12,17,19H,13H2,1-2H3
46 atoms
Cl 3.730769 -0.113823 -1.610931
Cl 4.476461 0.724523 1.049433
O  -2.066248 -2.231609 0.852755
O  -1.392907 -1.939504 -1.259478
O  -2.3908 2.794448 0.691385
C  1.303052 -3.111481 -0.130574
C  1.387687 -1.615013 -0.218029
C  0.215525 -2.257047 0.48983
C  2.200406 -3.833891 0.844501
C  1.054451 -3.88697 -1.399732
C  2.359551 -0.849656 0.581018
C  -1.133159 -2.128186 -0.096656
C  3.382837 -0.177035 0.07285
C  -3.423162 -2.021433 0.484256
C  -3.753375 -0.571502 0.245754
C  -2.881812 0.44852 0.597556
C  -4.989866 -0.253662 -0.31211
C  -3.232941 1.770811 0.352542
C  -5.343422 1.070358 -0.512891
C  -4.462537 2.095375 -0.194321
C  -1.072509 2.728172 0.331306
C  -0.656213 2.176805 -0.875826
C  -0.152521 3.29194 1.204954
C  0.692468 2.199555 -1.201136
C  1.191629 3.313898 0.861594
C  1.621395 2.767252 -0.339358
H  1.162763 -1.205853 -1.197755
H  0.234979 -2.216456 1.573504
H  3.196241 -3.970556 0.418463
H  2.313541 -3.302982 1.789415
H  1.798028 -4.823188 1.069781
H  2.009994 -4.181522 -1.837661
H  0.49201 -4.800082 -1.194924
H  0.513175 -3.318808 -2.152469
H  2.240859 -0.831013 1.657993
H  -3.688512 -2.621499 -0.389286
H  -4.002461 -2.402209 1.326394
H  -1.926214 0.236936 1.061328
H  -5.677573 -1.044037 -0.588754
H  -6.307285 1.310651 -0.942736
H  -4.725206 3.130615 -0.371347
H  -1.368923 1.741183 -1.564916
H  -0.490129 3.716636 2.142243
H  1.014385 1.773133 -2.14241
H  1.906308 3.756508 1.543563
H  2.669928 2.788839 -0.604004
elementType: Cl O C H
totalener: -1958.44962077 hartree
nucrepener: 2652.00547041 hartree
electener: -4610.45509118 hartree
oneelecener: -7958.00252285 hartree
twoeener: 3347.54743167 hartree
cpcmener: -0.02525059 hartree
kineticenergy: 1952.56704033 hartree
xcener: -143.511015303849 hartree
chargesum: 0.0000000
charge: -0.055474 -0.059111 -0.291797 -0.452972 -0.332342 0.124125 -0.035920 -0.063345 -0.255551 -0.277642 -0.174243 0.356473 0.034166 0.086503 0.032006 -0.196289 -0.234545 0.244762 -0.118391 -0.237125 0.289848 -0.192208 -0.249821 -0.151506 -0.115977 -0.165025 0.095079 0.096807 0.100188 0.089939 0.099624 0.095833 0.100876 0.095111 0.137241 0.118021 0.130027 0.147516 0.141868 0.157148 0.146134 0.151511 0.143973 0.151535 0.154386 0.138580
qa: -0.0555 -0.0591 -0.2918 -0.4530 -0.3323 0.1241 -0.0359 -0.0633 -0.2556 -0.2776 -0.1742 0.3565 0.0342 0.0865 0.0320 -0.1963 -0.2345 0.2448 -0.1184 -0.2371 0.2898 -0.1922 -0.2498 -0.1515 -0.1160 -0.1650 0.0951 0.0968 0.1002 0.0899 0.0996 0.0958 0.1009 0.0951 0.1372 0.1180 0.1300 0.1475 0.1419 0.1571 0.1461 0.1515 0.1440 0.1515 0.1544 0.1386
va: 1.2701 1.2482 2.1215 2.0447 2.0736 3.7640 3.8466 3.8625 3.9041 3.9000 3.8280 4.1794 4.2145 3.8070 3.6285 3.9236 3.9815 3.7572 3.8868 4.0123 3.6775 3.8936 4.0224 3.8413 3.9061 3.8401 1.0340 1.0349 1.0021 1.0028 1.0026 1.0012 0.9996 1.0195 1.0108 1.0107 0.9904 1.0093 1.0005 0.9888 1.0054 1.0025 1.0084 1.0012 0.9926 1.0114
dispcorr: -0.027490759 hartree
energy: -1958.477111526116
dipole: -19.21052 18.76378 -0.44674 -15.97987 14.59321 -1.38666 0.63983 0.25048 0.89031
magnitude: 1.70735 au
magnitude: 4.33974 debye
