program: Orca
programVersion: 5.0.3
elementType: Cl Cl O O O C C C C C C C C C C C C C C C C C C C C C H H H H H H H H H H H H H H H H H H H H
charge: 0
multiplicity: 1
keywords: wb97x-d3
keywords: def2-TZVPP
keywords: def2/J RIJCOSX
keywords: DEFGRID2
keywords: scfconv7
keywords: smallprint printgap noloewdin
keywords: NOSOSCF
formula: C21H20Cl2O3
InChI: InChI=1/C21H20Cl2O3/c1-21(2)17(12-18(22)23)19(21)20(24)25-13-14-7-6-10-16(11-14)26-15-8-4-3-5-9-15/h3-12,17,19H,13H2,1-2H3
46 atoms
Cl 2.748316 0.4370 1.701137
Cl 3.250189 -1.547205 3.731599
O  -1.87038 -2.307623 -0.89474
O  -0.40137 -0.871614 -1.778322
O  -2.415004 3.191311 -0.146216
C  1.671129 -3.091489 -1.021959
C  1.672668 -1.993169 -0.00109
C  0.363159 -2.663513 -0.392548
C  2.162057 -4.468907 -0.645295
C  2.002749 -2.726633 -2.448178
C  2.184834 -2.182812 1.359833
C  -0.641039 -1.844194 -1.103233
C  2.661535 -1.22478 2.144757
C  -2.980593 -1.532047 -1.378982
C  -3.233403 -0.36866 -0.46386
C  -2.7500 0.893467 -0.784386
C  -3.897632 -0.566372 0.7435
C  -2.889907 1.937548 0.12054
C  -4.067171 0.49284 1.621549
C  -3.552785 1.746473 1.323702
C  -1.22834 3.328052 -0.817781
C  -1.163488 4.298523 -1.806436
C  -0.111551 2.562902 -0.499731
C  0.030138 4.503622 -2.484647
C  1.069664 2.768728 -1.196291
C  1.147795 3.736421 -2.189357
H  1.797967 -0.997823 -0.412052
H  -0.052019 -3.362831 0.324435
H  1.825583 -4.795872 0.338086
H  1.802146 -5.203995 -1.367168
H  3.253188 -4.503396 -0.655596
H  3.071228 -2.86971 -2.619579
H  1.469213 -3.373016 -3.147844
H  1.768298 -1.694435 -2.696261
H  2.171741 -3.183144 1.775693
H  -2.812276 -1.212597 -2.408184
H  -3.82063 -2.224766 -1.372777
H  -2.251228 1.052709 -1.731476
H  -4.28386 -1.546674 0.994964
H  -4.590358 0.341624 2.55673
H  -3.663476 2.56988 2.018112
H  -2.040504 4.888171 -2.042231
H  -0.156879 1.813202 0.280415
H  0.079541 5.2619 -3.255374
H  1.937956 2.168723 -0.956583
H  2.074186 3.891315 -2.726456
elementType: Cl O C H
totalener: -1958.44862097 hartree
nucrepener: 2594.32910321 hartree
electener: -4552.77772418 hartree
oneelecener: -7842.99140460 hartree
twoeener: 3290.21368042 hartree
cpcmener: -0.02464035 hartree
kineticenergy: 1952.57748816 hartree
xcener: -143.508302247744 hartree
chargesum: 0.0000000
charge: -0.061934 -0.062112 -0.284529 -0.470202 -0.333375 0.087002 0.012497 -0.045072 -0.277657 -0.267713 -0.187689 0.399319 0.047805 0.082567 -0.018148 -0.151208 -0.232575 0.251504 -0.116026 -0.240453 0.279522 -0.242364 -0.185904 -0.126352 -0.117933 -0.189567 0.070776 0.094923 0.092084 0.097562 0.103252 0.095953 0.098694 0.095023 0.125565 0.116756 0.125958 0.139985 0.142576 0.157406 0.146336 0.145189 0.142740 0.156729 0.145471 0.157619
qa: -0.0619 -0.0621 -0.2845 -0.4702 -0.3334 0.0870 0.0125 -0.0451 -0.2777 -0.2677 -0.1877 0.3993 0.0478 0.0826 -0.0181 -0.1512 -0.2326 0.2515 -0.1160 -0.2405 0.2795 -0.2424 -0.1859 -0.1264 -0.1179 -0.1896 0.0708 0.0949 0.0921 0.0976 0.1033 0.0960 0.0987 0.0950 0.1256 0.1168 0.1260 0.1400 0.1426 0.1574 0.1463 0.1452 0.1427 0.1567 0.1455 0.1576
va: 1.2737 1.2431 2.1321 2.0250 2.0772 3.7516 3.8968 3.7873 3.9132 3.8968 3.8847 4.1725 4.1978 3.8053 3.6411 3.8624 3.9803 3.7527 3.8881 4.0197 3.7370 4.0084 3.8824 3.8880 3.8638 3.9458 1.0347 1.0312 1.0053 1.0014 0.9995 1.0001 0.9994 1.0202 1.0217 1.0105 0.9938 1.0237 1.0040 0.9886 1.0059 1.0079 1.0080 0.9892 0.9983 0.9910
dispcorr: -0.024423671 hartree
energy: -1958.473044642119
dipole: -10.24742 9.93891 -0.30851 -10.31954 8.45612 -1.86343 -23.83725 23.44034 -0.39692
magnitude: 1.93005 au
magnitude: 4.90579 debye
