program: Orca
programVersion: 5.0.3
elementType: Cl Cl O O O C C C C C C C C C C C C C C C C C C C C C H H H H H H H H H H H H H H H H H H H H
charge: 0
multiplicity: 1
keywords: wb97x-d3
keywords: def2-TZVPP
keywords: def2/J RIJCOSX
keywords: DEFGRID2
keywords: scfconv7
keywords: smallprint printgap noloewdin
keywords: NOSOSCF
formula: C21H20Cl2O3
InChI: InChI=1/C21H20Cl2O3/c1-21(2)17(12-18(22)23)19(21)20(24)25-13-14-7-6-10-16(11-14)26-15-8-4-3-5-9-15/h3-12,17,19H,13H2,1-2H3
46 atoms
Cl 3.184354 -4.706288 -3.233718
Cl 5.323192 -2.77806 -3.04616
O  -1.000493 -0.900849 -0.297159
O  -1.054836 -3.032014 -0.959174
O  -2.031495 3.088221 2.441822
C  1.666743 -3.074424 0.644461
C  1.912859 -3.108973 -0.837229
C  1.009865 -2.04295 -0.251216
C  2.736882 -2.554371 1.573888
C  0.864178 -4.202736 1.244257
C  3.198413 -2.708493 -1.419719
C  -0.437456 -2.079285 -0.547665
C  3.810368 -3.321037 -2.425286
C  -2.409896 -0.785603 -0.48317
C  -2.850984 0.579518 -0.043349
C  -2.205891 1.2632 0.981331
C  -3.969714 1.146319 -0.644952
C  -2.688178 2.495429 1.400665
C  -4.449861 2.371222 -0.206689
C  -3.819049 3.055767 0.820218
C  -1.901412 4.449646 2.485715
C  -1.552364 5.193474 1.364794
C  -2.074897 5.065064 3.716891
C  -1.391621 6.565795 1.486156
C  -1.898799 6.437285 3.825642
C  -1.564695 7.194553 2.712044
H  1.39086 -3.903509 -1.357851
H  1.42727 -1.045187 -0.17232
H  2.296846 -2.281537 2.534534
H  3.489813 -3.321949 1.761454
H  3.247086 -1.671727 1.190065
H  0.169272 -4.660103 0.543866
H  1.541829 -4.986101 1.588253
H  0.295385 -3.858464 2.110051
H  3.697432 -1.841168 -1.00394
H  -2.66834 -0.947748 -1.532266
H  -2.925531 -1.549956 0.105448
H  -1.329692 0.851834 1.466901
H  -4.470346 0.628537 -1.454017
H  -5.32765 2.802256 -0.670328
H  -4.208777 4.007635 1.157812
H  -1.403809 4.713758 0.405508
H  -2.34222 4.472434 4.582558
H  -1.12345 7.1451 0.612455
H  -2.033248 6.914876 4.787298
H  -1.43585 8.265328 2.798825
elementType: Cl O C H
totalener: -1958.45085120 hartree
nucrepener: 2364.41356972 hartree
electener: -4322.86442091 hartree
oneelecener: -7382.19672439 hartree
twoeener: 3059.33230348 hartree
cpcmener: -0.02516059 hartree
kineticenergy: 1952.56642815 hartree
xcener: -143.507919264759 hartree
chargesum: 0.0000000
charge: -0.056453 -0.061477 -0.278817 -0.465755 -0.328487 0.090067 0.029618 -0.066966 -0.266490 -0.268294 -0.202741 0.393699 0.042118 0.105290 0.032752 -0.254260 -0.221841 0.250455 -0.141282 -0.189711 0.272436 -0.185643 -0.240065 -0.147776 -0.125777 -0.181704 0.075795 0.096230 0.098404 0.100892 0.091290 0.094350 0.097795 0.100311 0.128514 0.111692 0.113458 0.128125 0.140808 0.157635 0.154667 0.157299 0.145628 0.159111 0.157198 0.157900
qa: -0.0565 -0.0615 -0.2788 -0.4658 -0.3285 0.0901 0.0296 -0.0670 -0.2665 -0.2683 -0.2027 0.3937 0.0421 0.1053 0.0328 -0.2543 -0.2218 0.2505 -0.1413 -0.1897 0.2724 -0.1856 -0.2401 -0.1478 -0.1258 -0.1817 0.0758 0.0962 0.0984 0.1009 0.0913 0.0944 0.0978 0.1003 0.1285 0.1117 0.1135 0.1281 0.1408 0.1576 0.1547 0.1573 0.1456 0.1591 0.1572 0.1579
va: 1.2690 1.2433 2.1408 2.0454 2.0705 3.7363 3.8686 3.8453 3.9090 3.9054 3.9022 4.1739 4.2093 3.7974 3.7463 4.0526 3.9675 3.7824 3.9108 3.9049 3.6995 3.9071 4.0032 3.8951 3.8873 3.9010 1.0519 1.0308 1.0015 1.0010 1.0054 1.0189 1.0005 0.9991 1.0191 0.9998 0.9951 1.0348 1.0044 0.9915 0.9970 0.9961 1.0079 0.9904 0.9895 0.9905
dispcorr: -0.020470463 hartree
energy: -1958.471321658629
dipole: -22.79967 22.39385 -0.40582 19.39341 -17.94888 1.44453 26.66229 -25.67622 0.98607
magnitude: 1.79546 au
magnitude: 4.56370 debye
