program: Orca
programVersion: 5.0.3
elementType: Cl Cl O O O C C C C C C C C C C C C C C C C C C C C C H H H H H H H H H H H H H H H H H H H H
charge: 0
multiplicity: 1
keywords: wb97x-d3
keywords: def2-TZVPP
keywords: def2/J RIJCOSX
keywords: DEFGRID2
keywords: scfconv7
keywords: smallprint printgap noloewdin
keywords: NOSOSCF
formula: C21H20Cl2O3
InChI: InChI=1/C21H20Cl2O3/c1-21(2)17(12-18(22)23)19(21)20(24)25-13-14-7-6-10-16(11-14)26-15-8-4-3-5-9-15/h3-12,17,19H,13H2,1-2H3
46 atoms
Cl 1.492188 -6.130137 -1.626031
Cl 2.274164 -5.304815 -4.277771
O  0.072256 -0.160914 0.074147
O  0.229797 -2.051527 1.251158
O  -3.169985 4.68583 1.101846
C  3.035735 -2.208806 -0.172533
C  2.050087 -3.12614 -0.837605
C  1.689255 -1.669613 -0.609652
C  4.229462 -1.705354 -0.948432
C  3.342653 -2.448863 1.284784
C  2.235886 -3.601851 -2.213258
C  0.607948 -1.347651 0.345416
C  2.029474 -4.843181 -2.635473
C  -1.047219 0.260799 0.859527
C  -1.658363 1.461551 0.198157
C  -2.061542 2.536895 0.981144
C  -1.889004 1.479633 -1.175155
C  -2.691136 3.626145 0.388332
C  -2.517204 2.571372 -1.752554
C  -2.917263 3.650939 -0.979967
C  -2.549729 5.126173 2.238088
C  -3.370882 5.533921 3.280458
C  -1.168185 5.240891 2.337604
C  -2.803655 6.062825 4.430585
C  -0.614801 5.759422 3.499592
C  -1.425121 6.172374 4.548837
H  1.561478 -3.819933 -0.162669
H  1.722066 -1.025935 -1.481526
H  3.992086 -1.439075 -1.977828
H  4.639554 -0.813992 -0.470121
H  5.017618 -2.460553 -0.970625
H  3.604647 -1.514624 1.785368
H  2.519969 -2.904726 1.830346
H  4.200906 -3.118299 1.368593
H  2.56573 -2.886441 -2.957079
H  -1.782274 -0.546529 0.921705
H  -0.724603 0.49621 1.876706
H  -1.889192 2.513435 2.050698
H  -1.590202 0.644593 -1.7955
H  -2.697859 2.586737 -2.819504
H  -3.407604 4.503934 -1.431592
H  -4.445996 5.444406 3.186675
H  -0.524947 4.938521 1.520726
H  -3.446604 6.383247 5.240355
H  0.461246 5.848903 3.577291
H  -0.985454 6.5801 5.449461
elementType: Cl O C H
totalener: -1958.45031142 hartree
nucrepener: 2358.33269805 hartree
electener: -4316.78300947 hartree
oneelecener: -7369.87643439 hartree
twoeener: 3053.09342492 hartree
cpcmener: -0.02542758 hartree
kineticenergy: 1952.54912132 hartree
xcener: -143.503563095186 hartree
chargesum: -0.0000000
charge: -0.055713 -0.061484 -0.281543 -0.468323 -0.326488 0.086571 0.032181 -0.063822 -0.261413 -0.267415 -0.204283 0.395278 0.040683 0.089611 0.019506 -0.210326 -0.240978 0.286342 -0.117955 -0.252006 0.298635 -0.254198 -0.206741 -0.117519 -0.139618 -0.189152 0.078204 0.095065 0.089636 0.097924 0.100484 0.099318 0.094370 0.096735 0.129241 0.112904 0.114814 0.142767 0.140884 0.156437 0.144542 0.145365 0.156760 0.158078 0.159340 0.157301
qa: -0.0557 -0.0615 -0.2815 -0.4683 -0.3265 0.0866 0.0322 -0.0638 -0.2614 -0.2674 -0.2043 0.3953 0.0407 0.0896 0.0195 -0.2103 -0.2410 0.2863 -0.1180 -0.2520 0.2986 -0.2542 -0.2067 -0.1175 -0.1396 -0.1892 0.0782 0.0951 0.0896 0.0979 0.1005 0.0993 0.0944 0.0967 0.1292 0.1129 0.1148 0.1428 0.1409 0.1564 0.1445 0.1454 0.1568 0.1581 0.1593 0.1573
va: 1.2698 1.2434 2.1349 2.0405 2.0816 3.7371 3.8520 3.8552 3.9084 3.9030 3.8983 4.1598 4.2094 3.8041 3.7381 3.9396 3.9662 3.7365 3.9062 4.0112 3.6809 4.0128 3.9217 3.8804 3.8875 3.9097 1.0501 1.0300 1.0055 1.0017 1.0012 0.9994 1.0197 1.0000 1.0183 0.9972 1.0029 1.0090 1.0122 0.9902 1.0081 1.0087 0.9972 0.9890 0.9901 0.9909
dispcorr: -0.020438492 hartree
energy: -1958.470749912135
dipole: 2.88164 -1.99380 0.88784 33.74194 -32.35193 1.39000 21.73481 -21.69560 0.03922
magnitude: 1.64982 au
magnitude: 4.19351 debye
