program: Orca
programVersion: 5.0.3
elementType: Cl Cl O O O C C C C C C C C C C C C C C C C C C C C C H H H H H H H H H H H H H H H H H H H H
charge: 0
multiplicity: 1
keywords: wb97x-d3
keywords: def2-TZVPP
keywords: def2/J RIJCOSX
keywords: DEFGRID2
keywords: scfconv7
keywords: smallprint printgap noloewdin
keywords: NOSOSCF
formula: C21H20Cl2O3
InChI: InChI=1/C21H20Cl2O3/c1-21(2)17(12-18(22)23)19(21)20(24)25-13-14-7-6-10-16(11-14)26-15-8-4-3-5-9-15/h3-12,17,19H,13H2,1-2H3
46 atoms
Cl 3.040592 -4.709097 -2.676019
Cl 4.684266 -2.601377 -3.763378
O  -1.12538 -0.61308 -0.173188
O  -0.857554 -2.818252 0.04064
O  -2.620601 4.105935 0.877591
C  2.09079 -1.920019 0.699658
C  2.009831 -2.490711 -0.687802
C  1.048024 -1.396971 -0.267522
C  3.202173 -0.963144 1.057625
C  1.698319 -2.818425 1.847082
C  3.014267 -2.187657 -1.713532
C  -0.387104 -1.717237 -0.11776
C  3.503881 -3.053113 -2.592325
C  -2.536534 -0.74754 0.004274
C  -3.162592 0.611784 -0.105209
C  -2.554826 1.727455 0.463167
C  -4.39067 0.744687 -0.742964
C  -3.187534 2.961479 0.395561
C  -5.011836 1.984005 -0.803283
C  -4.418989 3.097313 -0.232175
C  -1.851141 4.09419 2.00798
C  -0.727394 4.908768 2.009976
C  -2.198789 3.363592 3.138283
C  0.052967 4.994114 3.153866
C  -1.401633 3.449423 4.270527
C  -0.274962 4.26095 4.285835
H  1.570527 -3.480311 -0.738723
H  1.247404 -0.404489 -0.65628
H  4.121271 -1.508702 1.279804
H  3.422883 -0.243536 0.270158
H  2.933342 -0.393464 1.9490
H  2.585587 -3.323641 2.232921
H  1.268999 -2.238308 2.66627
H  0.983277 -3.588232 1.567437
H  3.390591 -1.173085 -1.771362
H  -2.952973 -1.419188 -0.749533
H  -2.743305 -1.181674 0.986838
H  -1.592987 1.636234 0.952488
H  -4.861493 -0.119137 -1.195813
H  -5.968259 2.084403 -1.299689
H  -4.898691 4.066901 -0.27747
H  -0.472379 5.476696 1.1238
H  -3.081996 2.737159 3.145181
H  0.92618 5.633776 3.153817
H  -1.67189 2.879445 5.15013
H  0.338605 4.325067 5.174713
elementType: Cl O C H
totalener: -1958.45063469 hartree
nucrepener: 2415.88691558 hartree
electener: -4374.33755027 hartree
oneelecener: -7485.03354491 hartree
twoeener: 3110.69599464 hartree
cpcmener: -0.02522938 hartree
kineticenergy: 1952.56070093 hartree
xcener: -143.506185181737 hartree
chargesum: 0.0000000
charge: -0.056296 -0.061727 -0.278656 -0.466594 -0.327766 0.087081 0.029781 -0.066787 -0.264871 -0.268609 -0.203064 0.394840 0.041541 0.104388 0.014721 -0.211287 -0.225836 0.272035 -0.115759 -0.250820 0.290820 -0.251808 -0.201013 -0.119272 -0.140640 -0.188326 0.077040 0.095681 0.100641 0.090919 0.098409 0.097607 0.100112 0.093870 0.129004 0.107237 0.116253 0.138393 0.140284 0.156654 0.145611 0.145876 0.155893 0.157621 0.159316 0.157504
qa: -0.0563 -0.0617 -0.2787 -0.4666 -0.3278 0.0871 0.0298 -0.0668 -0.2649 -0.2686 -0.2031 0.3948 0.0415 0.1044 0.0147 -0.2113 -0.2258 0.2720 -0.1158 -0.2508 0.2908 -0.2518 -0.2010 -0.1193 -0.1406 -0.1883 0.0770 0.0957 0.1006 0.0909 0.0984 0.0976 0.1001 0.0939 0.1290 0.1072 0.1163 0.1384 0.1403 0.1567 0.1456 0.1459 0.1559 0.1576 0.1593 0.1575
va: 1.2693 1.2433 2.1411 2.0445 2.0790 3.7376 3.8690 3.8493 3.9093 3.9047 3.8990 4.1740 4.2113 3.7978 3.7635 3.9193 3.9648 3.7374 3.9022 4.0096 3.6891 4.0102 3.9159 3.8826 3.8890 3.9086 1.0509 1.0315 1.0010 1.0057 1.0016 1.0005 0.9990 1.0195 1.0189 1.0034 0.9939 1.0224 1.0043 0.9896 1.0071 1.0084 0.9970 0.9892 0.9900 0.9908
dispcorr: -0.020726377 hartree
energy: -1958.471361066672
dipole: -15.91475 15.86551 -0.04924 19.45808 -18.36502 1.09306 30.20612 -29.03090 1.17522
magnitude: 1.60573 au
magnitude: 4.08144 debye
