program: Orca
programVersion: 5.0.3
elementType: Cl Cl O O O C C C C C C C C C C C C C C C C C C C C C H H H H H H H H H H H H H H H H H H H H
charge: 0
multiplicity: 1
keywords: wb97x-d3
keywords: def2-TZVPP
keywords: def2/J RIJCOSX
keywords: DEFGRID2
keywords: scfconv7
keywords: smallprint printgap noloewdin
keywords: NOSOSCF
formula: C21H20Cl2O3
InChI: InChI=1/C21H20Cl2O3/c1-21(2)17(12-18(22)23)19(21)20(24)25-13-14-7-6-10-16(11-14)26-15-8-4-3-5-9-15/h3-12,17,19H,13H2,1-2H3
46 atoms
Cl 2.49494 -5.218356 -3.25347
Cl 4.730166 -3.46839 -3.761092
O  -0.753827 -0.807731 -0.148745
O  -1.023945 -3.015529 -0.340423
O  -2.669824 3.358084 2.547588
C  1.972821 -3.014697 0.638299
C  1.892111 -3.279303 -0.838404
C  1.178501 -2.077564 -0.24762
C  3.237435 -2.443446 1.232741
C  1.27818 -3.984546 1.562303
C  3.032465 -3.053122 -1.733057
C  -0.299813 -2.052473 -0.251306
C  3.362472 -3.812029 -2.77063
C  -2.179033 -0.622301 -0.156181
C  -2.437423 0.849732 -0.055577
C  -2.406729 1.473545 1.18641
C  -2.689944 1.602535 -1.196845
C  -2.648892 2.836121 1.287261
C  -2.929584 2.964555 -1.086506
C  -2.91729 3.590938 0.150628
C  -2.33044 4.666593 2.765943
C  -1.169386 5.220245 2.239941
C  -3.159613 5.410969 3.592139
C  -0.849402 6.535335 2.543194
C  -2.821057 6.722194 3.896245
C  -1.671066 7.292055 3.36863
H  1.238154 -4.100288 -1.109351
H  1.642802 -1.112335 -0.416261
H  3.692602 -1.670904 0.614049
H  3.024396 -1.994858 2.204761
H  3.978808 -3.230015 1.386521
H  0.42947 -4.48698 1.103806
H  1.983782 -4.75641 1.875548
H  0.926253 -3.47767 2.463058
H  3.662961 -2.19307 -1.541576
H  -2.601222 -1.026336 -1.078342
H  -2.625301 -1.155623 0.685737
H  -2.209363 0.898185 2.083845
H  -2.709399 1.124091 -2.168193
H  -3.138798 3.549648 -1.972612
H  -3.125383 4.651031 0.219301
H  -0.515678 4.635262 1.604723
H  -4.059465 4.964964 3.997172
H  0.053771 6.967978 2.132612
H  -3.467325 7.300979 4.543578
H  -1.413178 8.316548 3.602545
elementType: Cl O C H
totalener: -1958.45132467 hartree
nucrepener: 2351.77509831 hartree
electener: -4310.22642298 hartree
oneelecener: -7356.99026720 hartree
twoeener: 3046.76384422 hartree
cpcmener: -0.02574706 hartree
kineticenergy: 1952.56039301 hartree
xcener: -143.503331512911 hartree
chargesum: 0.0000000
charge: -0.056430 -0.062025 -0.274279 -0.469653 -0.326698 0.084179 0.030616 -0.071755 -0.266336 -0.266350 -0.202070 0.397831 0.042608 0.086082 -0.023745 -0.238020 -0.181891 0.263745 -0.155388 -0.179638 0.271222 -0.189031 -0.237050 -0.143950 -0.125524 -0.178442 0.077123 0.094177 0.090603 0.098740 0.100704 0.093780 0.097040 0.099090 0.128036 0.110631 0.116198 0.132874 0.143368 0.158695 0.154937 0.157060 0.145642 0.158723 0.156780 0.157795
qa: -0.0564 -0.0620 -0.2743 -0.4697 -0.3267 0.0842 0.0306 -0.0718 -0.2663 -0.2663 -0.2021 0.3978 0.0426 0.0861 -0.0237 -0.2380 -0.1819 0.2637 -0.1554 -0.1796 0.2712 -0.1890 -0.2370 -0.1439 -0.1255 -0.1784 0.0771 0.0942 0.0906 0.0987 0.1007 0.0938 0.0970 0.0991 0.1280 0.1106 0.1162 0.1329 0.1434 0.1587 0.1549 0.1571 0.1456 0.1587 0.1568 0.1578
va: 1.2690 1.2428 2.1333 2.0375 2.0741 3.7392 3.8559 3.8589 3.9095 3.9038 3.9007 4.1712 4.2106 3.7924 3.7812 4.0350 3.9289 3.7564 3.9248 3.8977 3.6963 3.9224 4.0063 3.8907 3.8842 3.8997 1.0514 1.0327 1.0060 1.0012 1.0010 1.0194 1.0004 0.9995 1.0196 1.0002 0.9981 1.0191 1.0022 0.9914 0.9973 0.9962 1.0076 0.9903 0.9896 0.9905
dispcorr: -0.020297317 hartree
energy: -1958.471621990883
dipole: -14.87360 15.14477 0.27117 24.20220 -22.36874 1.83346 28.49373 -27.72299 0.77074
magnitude: 2.00727 au
magnitude: 5.10208 debye
