program: Orca
programVersion: 5.0.3
elementType: Cl Cl O O O C C C C C C C C C C C C C C C C C C C C C H H H H H H H H H H H H H H H H H H H H
charge: 0
multiplicity: 1
keywords: wb97x-d3
keywords: def2-TZVPP
keywords: def2/J RIJCOSX
keywords: DEFGRID2
keywords: scfconv7
keywords: smallprint printgap noloewdin
keywords: NOSOSCF
formula: C21H20Cl2O3
InChI: InChI=1/C21H20Cl2O3/c1-21(2)17(12-18(22)23)19(21)20(24)25-13-14-7-6-10-16(11-14)26-15-8-4-3-5-9-15/h3-12,17,19H,13H2,1-2H3
46 atoms
Cl 2.825489 -4.944007 -0.470964
Cl 5.024555 -3.786297 -1.938557
O  -0.994726 -0.023265 -1.863361
O  -1.246149 -1.724109 -0.436672
O  -3.053625 3.634183 1.163416
C  1.593736 -0.751076 0.517444
C  1.734915 -1.978624 -0.338262
C  0.928126 -0.797047 -0.84208
C  2.74868 0.212008 0.652331
C  0.779303 -0.868059 1.783005
C  2.995204 -2.305131 -1.016197
C  -0.53559 -0.925026 -0.996669
C  3.533434 -3.513684 -1.117278
C  -2.404614 0.01932 -2.093995
C  -3.150779 0.63896 -0.946523
C  -2.709758 1.841112 -0.402664
C  -4.30675 0.043521 -0.456321
C  -3.424392 2.429693 0.631079
C  -5.024282 0.653864 0.562388
C  -4.584198 1.844823 1.118788
C  -1.745622 3.856939 1.493916
C  -0.945828 2.871881 2.061767
C  -1.253346 5.138979 1.292499
C  0.358173 3.182488 2.420312
C  0.049718 5.436643 1.664324
C  0.863226 4.461062 2.224091
H  1.142317 -2.824991 -0.009275
H  1.405112 -0.181956 -1.597008
H  3.471743 -0.154888 1.383227
H  3.277869 0.385224 -0.284152
H  2.387292 1.180917 1.001998
H  0.046246 -1.670473 1.753711
H  1.445932 -1.066163 2.62463
H  0.251723 0.064078 1.995701
H  3.542576 -1.493411 -1.480545
H  -2.512988 0.628393 -2.991422
H  -2.792037 -0.975228 -2.321266
H  -1.818597 2.322356 -0.788993
H  -4.648615 -0.895978 -0.872537
H  -5.925533 0.189623 0.941118
H  -5.133814 2.318311 1.92245
H  -1.330363 1.873982 2.233408
H  -1.888645 5.897405 0.852405
H  0.979793 2.416065 2.865784
H  0.430578 6.437505 1.506748
H  1.880479 4.695299 2.508577
elementType: Cl O C H
totalener: -1958.44973428 hartree
nucrepener: 2516.41082638 hartree
electener: -4474.86056066 hartree
oneelecener: -7686.22565271 hartree
twoeener: 3211.36509205 hartree
cpcmener: -0.02623198 hartree
kineticenergy: 1952.56293355 hartree
xcener: -143.506577323718 hartree
chargesum: 0.0000000
charge: -0.055841 -0.061559 -0.287438 -0.458522 -0.332470 0.100996 0.024843 -0.071267 -0.266485 -0.265596 -0.203406 0.387481 0.038044 0.100783 0.028088 -0.217487 -0.211156 0.247137 -0.117775 -0.238569 0.272484 -0.170191 -0.247210 -0.170143 -0.119583 -0.188832 0.080412 0.094972 0.101542 0.090800 0.092463 0.099990 0.102429 0.078987 0.128016 0.122963 0.115401 0.140428 0.141654 0.157132 0.146859 0.162598 0.145442 0.167088 0.157789 0.156707
qa: -0.0558 -0.0616 -0.2874 -0.4585 -0.3325 0.1010 0.0248 -0.0713 -0.2665 -0.2656 -0.2034 0.3875 0.0380 0.1008 0.0281 -0.2175 -0.2112 0.2471 -0.1178 -0.2386 0.2725 -0.1702 -0.2472 -0.1701 -0.1196 -0.1888 0.0804 0.0950 0.1015 0.0908 0.0925 0.1000 0.1024 0.0790 0.1280 0.1230 0.1154 0.1404 0.1417 0.1571 0.1469 0.1626 0.1454 0.1671 0.1578 0.1567
va: 1.2697 1.2430 2.1210 2.0513 2.0705 3.6972 3.8832 3.8262 3.9153 3.9029 3.8968 4.2019 4.2108 3.7996 3.6258 3.9282 3.9586 3.7377 3.8946 4.0129 3.7241 3.8666 4.0063 3.8837 3.8936 3.9254 1.0481 1.0341 1.0005 1.0072 1.0045 1.0220 1.0006 1.0069 1.0192 0.9925 1.0096 1.0173 1.0041 0.9894 1.0056 0.9931 1.0081 0.9831 0.9884 0.9920
dispcorr: -0.024261508 hartree
energy: -1958.473995784944
dipole: -16.60606 16.89300 0.28694 29.78568 -28.46998 1.31570 13.50463 -13.74206 -0.23742
magnitude: 1.36740 au
magnitude: 3.47564 debye
