program: Orca
programVersion: 5.0.3
elementType: Cl Cl O O O C C C C C C C C C C C C C C C C C C C C C H H H H H H H H H H H H H H H H H H H H
charge: 0
multiplicity: 1
keywords: wb97x-d3
keywords: def2-TZVPP
keywords: def2/J RIJCOSX
keywords: DEFGRID2
keywords: scfconv7
keywords: smallprint printgap noloewdin
keywords: NOSOSCF
formula: C21H20Cl2O3
InChI: InChI=1/C21H20Cl2O3/c1-21(2)17(12-18(22)23)19(21)20(24)25-13-14-7-6-10-16(11-14)26-15-8-4-3-5-9-15/h3-12,17,19H,13H2,1-2H3
46 atoms
Cl 4.735538 -2.280246 -1.813844
Cl 5.591673 -1.940123 0.920625
O  -1.318746 -1.170634 -0.319627
O  -0.384603 -1.951998 -2.190793
O  -2.934911 3.528884 1.720959
C  0.938403 -3.988705 -0.194829
C  1.913669 -2.90514 -0.554346
C  0.528852 -2.537678 -0.054738
C  1.110409 -4.752707 1.096105
C  0.400709 -4.844821 -1.315098
C  3.071015 -2.585367 0.288462
C  -0.413225 -1.880637 -0.985006
C  4.291441 -2.304689 -0.150683
C  -2.28963 -0.446471 -1.092996
C  -3.105442 0.365071 -0.133777
C  -2.618778 1.587148 0.320152
C  -4.331723 -0.103709 0.323127
C  -3.371913 2.340365 1.210567
C  -5.06988 0.651087 1.22339
C  -4.598765 1.876299 1.667048
C  -2.227133 4.404837 0.944036
C  -2.579052 4.679514 -0.37226
C  -1.168506 5.068629 1.547065
C  -1.85033 5.620185 -1.085435
C  -0.456779 6.016251 0.825178
C  -0.788665 6.291738 -0.493806
H  2.055899 -2.769553 -1.620314
H  0.469131 -2.180735 0.967228
H  1.396575 -4.120575 1.935759
H  0.174928 -5.245689 1.366838
H  1.871129 -5.527797 0.985259
H  1.028386 -5.730629 -1.427611
H  -0.611635 -5.186933 -1.09149
H  0.380269 -4.337479 -2.276526
H  2.925826 -2.567942 1.36214
H  -1.783495 0.197023 -1.815174
H  -2.920501 -1.146767 -1.644258
H  -1.65753 1.944952 -0.030448
H  -4.712132 -1.054851 -0.028105
H  -6.026075 0.288379 1.57723
H  -5.176382 2.473159 2.36187
H  -3.412699 4.172181 -0.841363
H  -0.909728 4.84902 2.575361
H  -2.122386 5.832173 -2.111423
H  0.36623 6.536148 1.298245
H  -0.227321 7.026262 -1.056068
elementType: Cl O C H
totalener: -1958.45112289 hartree
nucrepener: 2395.69745621 hartree
electener: -4354.14857910 hartree
oneelecener: -7444.88499550 hartree
twoeener: 3090.73641640 hartree
cpcmener: -0.02574974 hartree
kineticenergy: 1952.56697690 hartree
xcener: -143.504489683164 hartree
chargesum: -0.0000000
charge: -0.056228 -0.061490 -0.274853 -0.470893 -0.327953 0.088967 0.032467 -0.079018 -0.263215 -0.269493 -0.202410 0.400527 0.040567 0.081240 -0.035054 -0.176858 -0.188435 0.255658 -0.127422 -0.232409 0.279649 -0.190509 -0.245898 -0.143488 -0.120444 -0.186328 0.078043 0.093455 0.090735 0.098066 0.100705 0.096822 0.099095 0.094492 0.128882 0.114194 0.116922 0.141502 0.142511 0.156749 0.146295 0.156228 0.145120 0.158682 0.157241 0.157584
qa: -0.0562 -0.0615 -0.2749 -0.4709 -0.3280 0.0890 0.0325 -0.0790 -0.2632 -0.2695 -0.2024 0.4005 0.0406 0.0812 -0.0351 -0.1769 -0.1884 0.2557 -0.1274 -0.2324 0.2796 -0.1905 -0.2459 -0.1435 -0.1204 -0.1863 0.0780 0.0935 0.0907 0.0981 0.1007 0.0968 0.0991 0.0945 0.1289 0.1142 0.1169 0.1415 0.1425 0.1567 0.1463 0.1562 0.1451 0.1587 0.1572 0.1576
va: 1.2693 1.2432 2.1324 2.0356 2.0752 3.7282 3.8539 3.8712 3.9089 3.9047 3.9001 4.1638 4.2099 3.8027 3.7703 3.8984 3.9276 3.7424 3.9071 4.0016 3.6962 3.9099 4.0071 3.8916 3.8839 3.9049 1.0501 1.0334 1.0056 1.0015 1.0010 1.0001 0.9993 1.0201 1.0186 0.9984 0.9996 1.0087 1.0027 0.9897 1.0066 0.9968 1.0083 0.9904 0.9892 0.9907
dispcorr: -0.020486745 hartree
energy: -1958.471609636241
dipole: -31.70484 30.58733 -1.11751 -0.51636 0.22357 -0.29279 1.95855 -1.24064 0.71791
magnitude: 1.36013 au
magnitude: 3.45717 debye
