program: Orca
programVersion: 5.0.3
elementType: Cl Cl O O O C C C C C C C C C C C C C C C C C C C C C H H H H H H H H H H H H H H H H H H H H
charge: 0
multiplicity: 1
keywords: wb97x-d3
keywords: def2-TZVPP
keywords: def2/J RIJCOSX
keywords: DEFGRID2
keywords: scfconv7
keywords: smallprint printgap noloewdin
keywords: NOSOSCF
formula: C21H20Cl2O3
InChI: InChI=1/C21H20Cl2O3/c1-21(2)17(12-18(22)23)19(21)20(24)25-13-14-7-6-10-16(11-14)26-15-8-4-3-5-9-15/h3-12,17,19H,13H2,1-2H3
46 atoms
Cl 2.823852 -4.904706 -0.496962
Cl 4.994949 -3.734783 -1.994562
O  -1.042166 -0.074849 -1.839791
O  -1.254139 -1.700603 -0.322867
O  -3.077605 3.618692 1.124999
C  1.597965 -0.715437 0.537961
C  1.736315 -1.943918 -0.31544
C  0.903352 -0.773266 -0.806343
C  2.741534 0.26491 0.64353
C  0.816784 -0.842641 1.823054
C  2.983251 -2.26127 -1.021499
C  -0.560344 -0.924826 -0.933687
C  3.51802 -3.469424 -1.146661
C  -2.454339 -0.068675 -2.055695
C  -3.20279 0.588279 -0.930417
C  -2.74712 1.790627 -0.400282
C  -4.380798 0.026906 -0.451767
C  -3.469339 2.413641 0.608013
C  -5.105458 0.671898 0.539954
C  -4.651563 1.864344 1.082443
C  -1.774276 3.799516 1.498244
C  -1.039943 2.801453 2.128509
C  -1.218563 5.051502 1.272918
C  0.262279 3.068476 2.526473
C  0.08226 5.30555 1.683498
C  0.830362 4.316265 2.306794
H  1.159744 -2.795154 0.028837
H  1.357248 -0.157749 -1.574882
H  3.486608 -0.089089 1.358523
H  3.246355 0.443425 -0.305309
H  2.373563 1.229602 0.998487
H  0.093016 -1.65369 1.810934
H  1.506878 -1.034016 2.646871
H  0.283759 0.082474 2.049555
H  3.521267 -1.44432 -1.487659
H  -2.584802 0.496829 -2.978775
H  -2.824883 -1.079924 -2.233809
H  -1.83803 2.246342 -0.775767
H  -4.734073 -0.913652 -0.856092
H  -6.023319 0.23326 0.909333
H  -5.206292 2.364751 1.866113
H  -1.473874 1.827127 2.317244
H  -1.803033 5.820473 0.783285
H  0.832464 2.292479 3.0212
H  0.512497 6.282854 1.506235
H  1.846027 4.515968 2.621925
elementType: Cl O C H
totalener: -1958.44975914 hartree
nucrepener: 2520.36479529 hartree
electener: -4478.81455442 hartree
oneelecener: -7694.16523260 hartree
twoeener: 3215.35067818 hartree
cpcmener: -0.02607013 hartree
kineticenergy: 1952.56507087 hartree
xcener: -143.507344359485 hartree
chargesum: 0.0000000
charge: -0.055873 -0.061292 -0.289331 -0.458601 -0.333127 0.104423 0.021817 -0.069496 -0.266513 -0.268374 -0.202247 0.388593 0.038498 0.103409 0.028023 -0.211480 -0.212160 0.240538 -0.118292 -0.236873 0.264498 -0.160296 -0.242434 -0.178775 -0.122278 -0.183093 0.080989 0.094594 0.101103 0.091157 0.092607 0.100265 0.102502 0.078223 0.128018 0.122211 0.115351 0.140291 0.141357 0.156993 0.146929 0.158986 0.145465 0.168900 0.157611 0.157181
qa: -0.0559 -0.0613 -0.2893 -0.4586 -0.3331 0.1044 0.0218 -0.0695 -0.2665 -0.2684 -0.2022 0.3886 0.0385 0.1034 0.0280 -0.2115 -0.2122 0.2405 -0.1183 -0.2369 0.2645 -0.1603 -0.2424 -0.1788 -0.1223 -0.1831 0.0810 0.0946 0.1011 0.0912 0.0926 0.1003 0.1025 0.0782 0.1280 0.1222 0.1154 0.1403 0.1414 0.1570 0.1469 0.1590 0.1455 0.1689 0.1576 0.1572
va: 1.2698 1.2434 2.1210 2.0503 2.0678 3.6887 3.8893 3.8284 3.9156 3.9027 3.8996 4.1936 4.2112 3.7980 3.6256 3.9251 3.9604 3.7438 3.8940 4.0128 3.7272 3.8574 4.0030 3.8801 3.8961 3.9121 1.0476 1.0342 1.0007 1.0070 1.0036 1.0232 1.0004 1.0076 1.0192 0.9923 1.0103 1.0180 1.0038 0.9894 1.0054 0.9960 1.0079 0.9818 0.9886 0.9916
dispcorr: -0.024344916 hartree
energy: -1958.474104050597
dipole: -16.58498 16.86284 0.27787 29.39222 -28.14129 1.25092 13.89778 -14.15337 -0.25559
magnitude: 1.30665 au
magnitude: 3.32125 debye
