program: Orca
programVersion: 5.0.3
elementType: Cl Cl O O O C C C C C C C C C C C C C C C C C C C C C H H H H H H H H H H H H H H H H H H H H
charge: 0
multiplicity: 1
keywords: wb97x-d3
keywords: def2-TZVPP
keywords: def2/J RIJCOSX
keywords: DEFGRID2
keywords: scfconv7
keywords: smallprint printgap noloewdin
keywords: NOSOSCF
formula: C21H20Cl2O3
InChI: InChI=1/C21H20Cl2O3/c1-21(2)17(12-18(22)23)19(21)20(24)25-13-14-7-6-10-16(11-14)26-15-8-4-3-5-9-15/h3-12,17,19H,13H2,1-2H3
46 atoms
Cl 3.77602 -0.039202 -1.759777
Cl 4.670086 0.527107 0.926785
O  -2.01118 -2.205456 0.73802
O  -1.36826 -1.739421 -1.352449
O  -2.563772 2.81804 0.820189
C  1.27974 -3.122506 -0.299273
C  1.462295 -1.63158 -0.37487
C  0.262934 -2.202033 0.345035
C  2.135767 -3.924119 0.64972
C  0.956973 -3.857317 -1.576264
C  2.492923 -0.949435 0.423981
C  -1.092476 -2.018094 -0.211929
C  3.505651 -0.253202 -0.074054
C  -3.379384 -2.025288 0.393574
C  -3.752955 -0.584131 0.172199
C  -2.953894 0.452819 0.632363
C  -4.948145 -0.294127 -0.480251
C  -3.328795 1.769053 0.392835
C  -5.333383 1.023415 -0.669943
C  -4.520592 2.066251 -0.248835
C  -1.20303 2.77453 0.683179
C  -0.454947 3.402808 1.669293
C  -0.578415 2.183992 -0.410251
C  0.927704 3.442803 1.558235
C  0.805247 2.224948 -0.502084
C  1.565201 2.850313 0.477286
H  1.257175 -1.200497 -1.349163
H  0.302269 -2.174875 1.428629
H  3.11044 -4.13314 0.204639
H  2.305491 -3.417219 1.599328
H  1.660002 -4.881507 0.870348
H  0.43944 -3.24178 -2.308604
H  1.88202 -4.205179 -2.039478
H  0.339878 -4.735496 -1.37612
H  2.431259 -1.021555 1.503567
H  -3.641169 -2.625022 -0.481284
H  -3.932573 -2.430307 1.241754
H  -2.034242 0.250665 1.167745
H  -5.57623 -1.099364 -0.84228
H  -6.266175 1.244754 -1.172411
H  -4.805065 3.097011 -0.418664
H  -0.954526 3.859809 2.514531
H  -1.154463 1.697204 -1.187288
H  1.507314 3.934853 2.328786
H  1.288776 1.76848 -1.356031
H  2.643641 2.878697 0.395626
elementType: Cl O C H
totalener: -1958.44975826 hartree
nucrepener: 2634.38091748 hartree
electener: -4592.83067574 hartree
oneelecener: -7922.59465520 hartree
twoeener: 3329.76397945 hartree
cpcmener: -0.02529597 hartree
kineticenergy: 1952.56736791 hartree
xcener: -143.511084994356 hartree
chargesum: 0.0000000
charge: -0.057629 -0.059785 -0.290865 -0.451022 -0.330725 0.107543 -0.017036 -0.054560 -0.256527 -0.272241 -0.167587 0.361328 0.016376 0.089957 0.042188 -0.228905 -0.240587 0.278448 -0.111072 -0.254711 0.306736 -0.256111 -0.206058 -0.115799 -0.151001 -0.174080 0.092193 0.095954 0.100692 0.089012 0.099551 0.094294 0.096845 0.101111 0.135742 0.117575 0.127499 0.146438 0.141644 0.157325 0.145557 0.144036 0.150139 0.156419 0.153384 0.148316
qa: -0.0576 -0.0598 -0.2909 -0.4510 -0.3307 0.1075 -0.0170 -0.0546 -0.2565 -0.2722 -0.1676 0.3613 0.0164 0.0900 0.0422 -0.2289 -0.2406 0.2784 -0.1111 -0.2547 0.3067 -0.2561 -0.2061 -0.1158 -0.1510 -0.1741 0.0922 0.0960 0.1007 0.0890 0.0996 0.0943 0.0968 0.1011 0.1357 0.1176 0.1275 0.1464 0.1416 0.1573 0.1456 0.1440 0.1501 0.1564 0.1534 0.1483
va: 1.2650 1.2452 2.1204 2.0483 2.0824 3.7798 3.8457 3.8307 3.9042 3.9025 3.8128 4.1846 4.1889 3.8027 3.6107 3.9284 3.9860 3.7302 3.8859 4.0228 3.6722 4.0201 3.9079 3.9130 3.8518 3.8640 1.0346 1.0357 1.0018 1.0037 1.0023 1.0192 1.0010 0.9996 1.0131 1.0095 0.9903 1.0132 1.0012 0.9886 1.0064 1.0087 1.0058 0.9893 0.9993 1.0066
dispcorr: -0.026962357 hartree
energy: -1958.476720622081
dipole: -20.09729 19.69889 -0.39841 -16.03505 14.48984 -1.54521 1.58915 -0.67348 0.91567
magnitude: 1.83979 au
magnitude: 4.67639 debye
