program: Orca
programVersion: 5.0.3
elementType: Cl Cl O O O C C C C C C C C C C C C C C C C C C C C C H H H H H H H H H H H H H H H H H H H H
charge: 0
multiplicity: 1
keywords: wb97x-d3
keywords: def2-TZVPP
keywords: def2/J RIJCOSX
keywords: DEFGRID2
keywords: scfconv7
keywords: smallprint printgap noloewdin
keywords: NOSOSCF
formula: C21H20Cl2O3
InChI: InChI=1/C21H20Cl2O3/c1-21(2)17(12-18(22)23)19(21)20(24)25-13-14-7-6-10-16(11-14)26-15-8-4-3-5-9-15/h3-12,17,19H,13H2,1-2H3
46 atoms
Cl 4.886932 -1.415762 0.04548
Cl 5.236504 -4.270432 -0.191354
O  -1.517656 -1.965237 0.884682
O  -0.064719 -0.269368 0.777819
O  -3.477245 3.447483 0.15837
C  0.843362 -1.966372 -1.735379
C  1.864701 -2.017294 -0.632223
C  0.417555 -2.335966 -0.328126
C  0.78111 -3.072511 -2.7600
C  0.504618 -0.613381 -2.312736
C  2.857981 -3.094583 -0.548075
C  -0.376987 -1.400752 0.495768
C  4.146039 -2.93781 -0.269712
C  -2.457769 -1.149196 1.597328
C  -3.127853 -0.168706 0.677116
C  -2.969611 1.196189 0.875323
C  -3.89566 -0.630405 -0.389044
C  -3.561243 2.09452 -0.004722
C  -4.490746 0.274854 -1.253092
C  -4.319825 1.639759 -1.073217
C  -2.327008 4.046523 0.589147
C  -2.481579 5.211408 1.329676
C  -1.058405 3.577659 0.266719
C  -1.360159 5.910083 1.750914
C  0.054142 4.281585 0.70709
C  -0.087159 5.446843 1.44784
H  2.197311 -1.044865 -0.287084
H  0.16793 -3.382464 -0.191213
H  1.541606 -2.927661 -3.52971
H  0.924336 -4.063824 -2.331677
H  -0.192439 -3.07102 -3.253064
H  1.136022 -0.420282 -3.181733
H  -0.533663 -0.582358 -2.648779
H  0.657651 0.20621 -1.614204
H  2.521024 -4.10937 -0.724699
H  -3.177781 -1.858649 2.003295
H  -1.974507 -0.64504 2.435693
H  -2.379844 1.550137 1.712321
H  -4.031782 -1.693916 -0.543429
H  -5.089965 -0.080853 -2.081223
H  -4.776633 2.34884 -1.752329
H  -3.475887 5.569225 1.567057
H  -0.925452 2.676045 -0.318103
H  -1.486513 6.818794 2.32541
H  1.041116 3.912092 0.460131
H  0.786496 5.989446 1.784236
elementType: Cl O C H
totalener: -1958.44995584 hartree
nucrepener: 2488.20281001 hartree
electener: -4446.65276586 hartree
oneelecener: -7630.37326379 hartree
twoeener: 3183.72049793 hartree
cpcmener: -0.02486338 hartree
kineticenergy: 1952.56418072 hartree
xcener: -143.506409778240 hartree
chargesum: -0.0000000
charge: -0.056473 -0.061842 -0.281278 -0.460738 -0.327510 0.091445 0.029652 -0.081507 -0.265198 -0.262416 -0.205139 0.391712 0.040545 0.087209 0.013941 -0.205094 -0.251885 0.296386 -0.106939 -0.255797 0.314982 -0.261569 -0.210143 -0.116245 -0.147507 -0.190423 0.077560 0.096712 0.101101 0.089567 0.097984 0.099794 0.098032 0.088656 0.128984 0.127401 0.114362 0.143907 0.140565 0.157884 0.146231 0.143967 0.156649 0.157357 0.157832 0.157287
qa: -0.0565 -0.0618 -0.2813 -0.4607 -0.3275 0.0914 0.0297 -0.0815 -0.2652 -0.2624 -0.2051 0.3917 0.0405 0.0872 0.0139 -0.2051 -0.2519 0.2964 -0.1069 -0.2558 0.3150 -0.2616 -0.2101 -0.1162 -0.1475 -0.1904 0.0776 0.0967 0.1011 0.0896 0.0980 0.0998 0.0980 0.0887 0.1290 0.1274 0.1144 0.1439 0.1406 0.1579 0.1462 0.1440 0.1566 0.1574 0.1578 0.1573
va: 1.2690 1.2430 2.1261 2.0475 2.0865 3.7328 3.8677 3.8220 3.9051 3.9095 3.8956 4.2170 4.2106 3.8065 3.6085 3.9164 3.9685 3.7109 3.8804 4.0228 3.6796 4.0055 3.9044 3.8820 3.8984 3.9115 1.0496 1.0331 1.0010 1.0058 1.0015 1.0015 1.0002 1.0166 1.0183 0.9921 1.0098 1.0105 1.0089 0.9886 1.0069 1.0097 0.9942 0.9890 0.9909 0.9906
dispcorr: -0.022964048 hartree
energy: -1958.472919891381
dipole: -30.00716 28.91001 -1.09715 12.73753 -13.81680 -1.07927 -9.10589 8.54313 -0.56275
magnitude: 1.63868 au
magnitude: 4.16519 debye
