program: Orca
programVersion: 5.0.3
elementType: Cl Cl O O O C C C C C C C C C C C C C C C C C C C C C H H H H H H H H H H H H H H H H H H H H
charge: 0
multiplicity: 1
keywords: wb97x-d3
keywords: def2-TZVPP
keywords: def2/J RIJCOSX
keywords: DEFGRID2
keywords: scfconv7
keywords: smallprint printgap noloewdin
keywords: NOSOSCF
formula: C21H20Cl2O3
InChI: InChI=1/C21H20Cl2O3/c1-21(2)17(12-18(22)23)19(21)20(24)25-13-14-7-6-10-16(11-14)26-15-8-4-3-5-9-15/h3-12,17,19H,13H2,1-2H3
46 atoms
Cl 3.445114 -3.891779 1.496833
Cl 4.801426 -4.628943 -0.941455
O  -1.725615 -1.57602 -1.634486
O  -1.102293 -1.893686 0.489012
O  -2.092313 3.295347 -0.567365
C  1.508494 -0.590034 -0.832258
C  1.736056 -2.002004 -0.360479
C  0.547563 -1.689606 -1.237468
C  2.361702 -0.012355 -1.934699
C  1.110155 0.434678 0.202219
C  2.810089 -2.840058 -0.906164
C  -0.816883 -1.745135 -0.673387
C  3.57697 -3.665135 -0.204707
C  -3.084923 -1.413569 -1.232312
C  -3.306609 -0.121568 -0.494998
C  -2.584742 1.018244 -0.833837
C  -4.249793 -0.054795 0.522571
C  -2.803931 2.204078 -0.151299
C  -4.473412 1.143471 1.186667
C  -3.753616 2.282129 0.86014
C  -1.502265 4.131127 0.337666
C  -1.38621 5.46458 -0.033635
C  -0.980245 3.686042 1.546851
C  -0.742711 6.356591 0.810779
C  -0.348008 4.593724 2.385858
C  -0.225867 5.928762 2.026418
H  1.498701 -2.166192 0.684468
H  0.614871 -1.985899 -2.278788
H  2.574295 -0.724794 -2.730649
H  1.855097 0.840208 -2.39102
H  3.314848 0.343057 -1.538374
H  2.004797 0.885196 0.636452
H  0.528719 1.238727 -0.254066
H  0.526599 0.019726 1.021745
H  2.993002 -2.798295 -1.973436
H  -3.648944 -1.423399 -2.165876
H  -3.420558 -2.264788 -0.63594
H  -1.843848 0.999006 -1.624442
H  -4.807414 -0.940074 0.802895
H  -5.213304 1.191394 1.97523
H  -3.933032 3.212002 1.385095
H  -1.793045 5.796087 -0.980938
H  -1.055221 2.645762 1.837845
H  -0.651977 7.39409 0.51577
H  0.057611 4.246278 3.327448
H  0.270185 6.628668 2.685761
elementType: Cl O C H
totalener: -1958.44979325 hartree
nucrepener: 2500.11914752 hartree
electener: -4458.56894077 hartree
oneelecener: -7653.97133114 hartree
twoeener: 3195.40239037 hartree
cpcmener: -0.02612551 hartree
kineticenergy: 1952.56403305 hartree
xcener: -143.508089371006 hartree
chargesum: 0.0000000
charge: -0.056389 -0.062239 -0.285670 -0.445595 -0.332577 0.105406 0.023458 -0.066252 -0.266260 -0.273045 -0.204082 0.363315 0.039610 0.093825 0.053608 -0.304524 -0.215534 0.277106 -0.124545 -0.197443 0.316293 -0.258657 -0.202506 -0.121928 -0.158911 -0.185330 0.076556 0.098427 0.090718 0.097995 0.101125 0.107090 0.084923 0.098264 0.128902 0.122295 0.117709 0.137444 0.141252 0.158628 0.156306 0.144506 0.154270 0.156968 0.157949 0.157540
qa: -0.0564 -0.0622 -0.2857 -0.4456 -0.3326 0.1054 0.0235 -0.0663 -0.2663 -0.2730 -0.2041 0.3633 0.0396 0.0938 0.0536 -0.3045 -0.2155 0.2771 -0.1245 -0.1974 0.3163 -0.2587 -0.2025 -0.1219 -0.1589 -0.1853 0.0766 0.0984 0.0907 0.0980 0.1011 0.1071 0.0849 0.0983 0.1289 0.1223 0.1177 0.1374 0.1413 0.1586 0.1563 0.1445 0.1543 0.1570 0.1579 0.1575
va: 1.2693 1.2424 2.1159 2.0604 2.0544 3.7404 3.8959 3.8020 3.9016 3.8964 3.8988 4.2438 4.2090 3.7958 3.6099 4.0174 3.9826 3.7297 3.8908 3.9371 3.6421 4.0144 3.8842 3.8902 3.9149 3.9046 1.0510 1.0322 1.0054 1.0024 1.0012 1.0025 1.0036 1.0165 1.0186 0.9922 1.0083 1.0247 1.0031 0.9899 0.9959 1.0093 0.9986 0.9893 0.9910 0.9905
dispcorr: -0.024065958 hartree
energy: -1958.473859208061
dipole: -20.80675 20.17547 -0.63128 33.30471 -32.28645 1.01826 -2.46490 1.60361 -0.86129
magnitude: 1.47553 au
magnitude: 3.75049 debye
